BDBM50136702 (+/-)-1-(6,7-dimethoxy-3,4-dihydroisoquinolin-2(1H)-yl)-2,3-diphenylpropan-1-one::1-(6,7-Dimethoxy-3,4-dihydro-1H-isoquinolin-2-yl)-2,3-diphenyl-propan-1-one::CHEMBL140260
SMILES: COc1cc2CCN(Cc2cc1OC)C(=O)C(Cc1ccccc1)c1ccccc1
InChI Key: InChIKey=DRSDLTFJRNRLDX-UHFFFAOYSA-N
Data: 4 IC50
Activity Spreadsheet -- Enzyme Inhibition Constant Data from BindingDB
Found 4 hits for monomerid = 50136702
Trg + Lig
Ki
nM
ΔG°
kcal/mole
IC50
nM
Kd
nM
EC50/IC50
nM
koff
s-1
kon
M-1s-1
pHTemp
°C
Orexin receptor type 1
(Homo sapiens (Human))
BDBM50136702
((+/-)-1-(6,7-dimethoxy-3,4-dihydroisoquinolin-2(1H...)
Show SMILES COc1cc2CCN(Cc2cc1OC)C(=O)C(Cc1ccccc1)c1ccccc1
Show InChI InChI=1S/C26H27NO3/c1-29-24-16-21-13-14-27(18-22(21)17-25(24)30-2)26(28)23(20-11-7-4-8-12-20)15-19-9-5-3-6-10-19/h3-12,16-17,23H,13-15,18H2,1-2H3
Reactome pathway
n/an/a>1.00E+4n/an/an/an/an/an/a
Banyu Tsukuba Research Institute
Curated by ChEMBL
Assay Description
Inhibitory concentration against human orexin-1 receptor (hOX1R)
Bioorg Med Chem Lett 13: 4497-9 (2003)
BindingDB Entry DOI: 10.7270/Q20R9NT7
Orexin receptor type 2
(Homo sapiens (Human))
BDBM50136702
((+/-)-1-(6,7-dimethoxy-3,4-dihydroisoquinolin-2(1H...)
Show SMILES COc1cc2CCN(Cc2cc1OC)C(=O)C(Cc1ccccc1)c1ccccc1
Show InChI InChI=1S/C26H27NO3/c1-29-24-16-21-13-14-27(18-22(21)17-25(24)30-2)26(28)23(20-11-7-4-8-12-20)15-19-9-5-3-6-10-19/h3-12,16-17,23H,13-15,18H2,1-2H3
Reactome pathway
n/an/a 395n/an/an/an/an/an/a
Actelion Pharmaceuticals Ltd.
Curated by ChEMBL
Assay Description
Antagonist activity at human OX2 receptor
J Med Chem 52: 891-903 (2009)
Article DOI: 10.1021/jm801296d
BindingDB Entry DOI: 10.7270/Q2TM7B3D
Orexin receptor type 1
(Homo sapiens (Human))
BDBM50136702
((+/-)-1-(6,7-dimethoxy-3,4-dihydroisoquinolin-2(1H...)
Show SMILES COc1cc2CCN(Cc2cc1OC)C(=O)C(Cc1ccccc1)c1ccccc1
Show InChI InChI=1S/C26H27NO3/c1-29-24-16-21-13-14-27(18-22(21)17-25(24)30-2)26(28)23(20-11-7-4-8-12-20)15-19-9-5-3-6-10-19/h3-12,16-17,23H,13-15,18H2,1-2H3
Reactome pathway
n/an/a>1.00E+4n/an/an/an/an/an/a
Actelion Pharmaceuticals Ltd.
Curated by ChEMBL
Assay Description
Antagonist activity at human OX1 receptor
J Med Chem 52: 891-903 (2009)
Article DOI: 10.1021/jm801296d
BindingDB Entry DOI: 10.7270/Q2TM7B3D
Orexin receptor type 2
(Homo sapiens (Human))
BDBM50136702
((+/-)-1-(6,7-dimethoxy-3,4-dihydroisoquinolin-2(1H...)
Show SMILES COc1cc2CCN(Cc2cc1OC)C(=O)C(Cc1ccccc1)c1ccccc1
Show InChI InChI=1S/C26H27NO3/c1-29-24-16-21-13-14-27(18-22(21)17-25(24)30-2)26(28)23(20-11-7-4-8-12-20)15-19-9-5-3-6-10-19/h3-12,16-17,23H,13-15,18H2,1-2H3
Reactome pathway
n/an/a 395n/an/an/an/an/an/a
Banyu Tsukuba Research Institute
Curated by ChEMBL
Assay Description
Inhibitory concentration against human orexin-2 receptor (hOX2R)
Bioorg Med Chem Lett 13: 4497-9 (2003)
BindingDB Entry DOI: 10.7270/Q20R9NT7