BDBM50136703 (+/-)-3-bromo-N-(1-(6,7-dimethoxy-3,4-dihydroisoquinolin-2(1H)-yl)-1-oxo-3-phenylpropan-2-yl)-4-fluorobenzamide::CHEMBL138091::N-[1-Benzyl-2-(6,7-dimethoxy-3,4-dihydro-1H-isoquinolin-2-yl)-2-oxo-ethyl]-3-bromo-4-fluoro-benzamide
SMILES: COc1cc2CCN(Cc2cc1OC)C(=O)C(Cc1ccccc1)NC(=O)c1ccc(F)c(Br)c1
InChI Key: InChIKey=ASKXKLWUDBSGDD-UHFFFAOYSA-N
Data: 4 IC50
Activity Spreadsheet -- Enzyme Inhibition Constant Data from BindingDB
Found 4 hits for monomerid = 50136703
Trg + Lig
Ki
nM
ΔG°
kcal/mole
IC50
nM
Kd
nM
EC50/IC50
nM
koff
s-1
kon
M-1s-1
pHTemp
°C
Orexin receptor type 2
(Homo sapiens (Human))
BDBM50136703
((+/-)-3-bromo-N-(1-(6,7-dimethoxy-3,4-dihydroisoqu...)
Show SMILES COc1cc2CCN(Cc2cc1OC)C(=O)C(Cc1ccccc1)NC(=O)c1ccc(F)c(Br)c1
Show InChI InChI=1S/C27H26BrFN2O4/c1-34-24-14-18-10-11-31(16-20(18)15-25(24)35-2)27(33)23(12-17-6-4-3-5-7-17)30-26(32)19-8-9-22(29)21(28)13-19/h3-9,13-15,23H,10-12,16H2,1-2H3,(H,30,32)
Reactome pathway
n/an/a 70n/an/an/an/an/an/a
Banyu Tsukuba Research Institute
Curated by ChEMBL
Assay Description
Inhibitory concentration against human orexin-2 receptor (hOX2R)
Bioorg Med Chem Lett 13: 4497-9 (2003)
BindingDB Entry DOI: 10.7270/Q20R9NT7
Orexin receptor type 2
(Homo sapiens (Human))
BDBM50136703
((+/-)-3-bromo-N-(1-(6,7-dimethoxy-3,4-dihydroisoqu...)
Show SMILES COc1cc2CCN(Cc2cc1OC)C(=O)C(Cc1ccccc1)NC(=O)c1ccc(F)c(Br)c1
Show InChI InChI=1S/C27H26BrFN2O4/c1-34-24-14-18-10-11-31(16-20(18)15-25(24)35-2)27(33)23(12-17-6-4-3-5-7-17)30-26(32)19-8-9-22(29)21(28)13-19/h3-9,13-15,23H,10-12,16H2,1-2H3,(H,30,32)
Reactome pathway
n/an/a 70n/an/an/an/an/an/a
Actelion Pharmaceuticals Ltd.
Curated by ChEMBL
Assay Description
Antagonist activity at human OX2 receptor
J Med Chem 52: 891-903 (2009)
Article DOI: 10.1021/jm801296d
BindingDB Entry DOI: 10.7270/Q2TM7B3D
Orexin receptor type 1
(Homo sapiens (Human))
BDBM50136703
((+/-)-3-bromo-N-(1-(6,7-dimethoxy-3,4-dihydroisoqu...)
Show SMILES COc1cc2CCN(Cc2cc1OC)C(=O)C(Cc1ccccc1)NC(=O)c1ccc(F)c(Br)c1
Show InChI InChI=1S/C27H26BrFN2O4/c1-34-24-14-18-10-11-31(16-20(18)15-25(24)35-2)27(33)23(12-17-6-4-3-5-7-17)30-26(32)19-8-9-22(29)21(28)13-19/h3-9,13-15,23H,10-12,16H2,1-2H3,(H,30,32)
Reactome pathway
n/an/a 5.90E+3n/an/an/an/an/an/a
Actelion Pharmaceuticals Ltd.
Curated by ChEMBL
Assay Description
Antagonist activity at human OX1 receptor
J Med Chem 52: 891-903 (2009)
Article DOI: 10.1021/jm801296d
BindingDB Entry DOI: 10.7270/Q2TM7B3D
Orexin receptor type 1
(Homo sapiens (Human))
BDBM50136703
((+/-)-3-bromo-N-(1-(6,7-dimethoxy-3,4-dihydroisoqu...)
Show SMILES COc1cc2CCN(Cc2cc1OC)C(=O)C(Cc1ccccc1)NC(=O)c1ccc(F)c(Br)c1
Show InChI InChI=1S/C27H26BrFN2O4/c1-34-24-14-18-10-11-31(16-20(18)15-25(24)35-2)27(33)23(12-17-6-4-3-5-7-17)30-26(32)19-8-9-22(29)21(28)13-19/h3-9,13-15,23H,10-12,16H2,1-2H3,(H,30,32)
Reactome pathway
n/an/a 5.90E+3n/an/an/an/an/an/a
Banyu Tsukuba Research Institute
Curated by ChEMBL
Assay Description
Inhibitory concentration against human orexin-1 receptor (hOX1R)
Bioorg Med Chem Lett 13: 4497-9 (2003)
BindingDB Entry DOI: 10.7270/Q20R9NT7