BDBM50136720 CHEMBL343551::N-[1-Benzyl-2-(6,7-dimethoxy-3,4-dihydro-1H-isoquinolin-2-yl)-2-oxo-ethyl]-3,5-dichloro-benzamide
SMILES: COc1cc2CCN(Cc2cc1OC)C(=O)C(Cc1ccccc1)NC(=O)c1cc(Cl)cc(Cl)c1
InChI Key: InChIKey=HDLDKTIFZITSKM-UHFFFAOYSA-N
Data: 2 IC50
Activity Spreadsheet -- Enzyme Inhibition Constant Data from BindingDB
Found 2 hits for monomerid = 50136720
Trg + Lig
Ki
nM
ΔG°
kcal/mole
IC50
nM
Kd
nM
EC50/IC50
nM
koff
s-1
kon
M-1s-1
pHTemp
°C
Orexin receptor type 2
(Homo sapiens (Human))
BDBM50136720
(CHEMBL343551 | N-[1-Benzyl-2-(6,7-dimethoxy-3,4-di...)
Show SMILES COc1cc2CCN(Cc2cc1OC)C(=O)C(Cc1ccccc1)NC(=O)c1cc(Cl)cc(Cl)c1
Show InChI InChI=1S/C27H26Cl2N2O4/c1-34-24-13-18-8-9-31(16-20(18)14-25(24)35-2)27(33)23(10-17-6-4-3-5-7-17)30-26(32)19-11-21(28)15-22(29)12-19/h3-7,11-15,23H,8-10,16H2,1-2H3,(H,30,32)
Reactome pathway
n/an/a 36n/an/an/an/an/an/a
Banyu Tsukuba Research Institute
Curated by ChEMBL
Assay Description
Inhibitory concentration against human orexin-2 receptor (hOX2R)
Bioorg Med Chem Lett 13: 4497-9 (2003)
BindingDB Entry DOI: 10.7270/Q20R9NT7
Orexin receptor type 1
(Homo sapiens (Human))
BDBM50136720
(CHEMBL343551 | N-[1-Benzyl-2-(6,7-dimethoxy-3,4-di...)
Show SMILES COc1cc2CCN(Cc2cc1OC)C(=O)C(Cc1ccccc1)NC(=O)c1cc(Cl)cc(Cl)c1
Show InChI InChI=1S/C27H26Cl2N2O4/c1-34-24-13-18-8-9-31(16-20(18)14-25(24)35-2)27(33)23(10-17-6-4-3-5-7-17)30-26(32)19-11-21(28)15-22(29)12-19/h3-7,11-15,23H,8-10,16H2,1-2H3,(H,30,32)
Reactome pathway
n/an/a 5.30E+3n/an/an/an/an/an/a
Banyu Tsukuba Research Institute
Curated by ChEMBL
Assay Description
Inhibitory concentration against human orexin-1 receptor (hOX1R)
Bioorg Med Chem Lett 13: 4497-9 (2003)
BindingDB Entry DOI: 10.7270/Q20R9NT7