BDBM50136899 CHEMBL152440::[4-(2-Amino-phenylamino)-phenyl]-(2-bromo-phenyl)-methanone
SMILES: Nc1ccccc1Nc1ccc(cc1)C(=O)c1ccccc1Br
InChI Key: InChIKey=MSGGRRJXKDUMOF-UHFFFAOYSA-N
Data: 1 IC50
Activity Spreadsheet -- Enzyme Inhibition Constant Data from BindingDB
Found 1 hit for monomerid = 50136899
Trg + Lig
Ki
nM
ΔG°
kcal/mole
IC50
nM
Kd
nM
EC50/IC50
nM
koff
s-1
kon
M-1s-1
pHTemp
°C
Mitogen-activated protein kinase 14
(Homo sapiens (Human))
BDBM50136899
(CHEMBL152440 | [4-(2-Amino-phenylamino)-phenyl]-(2...)
Show SMILES Nc1ccccc1Nc1ccc(cc1)C(=O)c1ccccc1Br
Show InChI InChI=1S/C19H15BrN2O/c20-16-6-2-1-5-15(16)19(23)13-9-11-14(12-10-13)22-18-8-4-3-7-17(18)21/h1-12,22H,21H2
NCI pathway
Reactome pathway
n/an/a 54n/an/an/an/an/an/a
LEO Pharma
Curated by ChEMBL
Assay Description
In vitro inhibitory activity determined against human mitogen-activated protein kinase p38 alpha
J Med Chem 46: 5651-62 (2003)
Article DOI: 10.1021/jm030851s
BindingDB Entry DOI: 10.7270/Q2B56KFK