BDBM50137257 1-[4-((S)-1-Amino-2-oxo-2-thiazolidin-3-yl-ethyl)-cyclohexyl]-3-(4-iodo-phenyl)-urea::CHEMBL3084953
SMILES: [H][C@@]1(CC[C@@H](CC1)NC(=O)Nc1ccc(I)cc1)[C@H](N)C(=O)N1CCSC1
InChI Key: InChIKey=VVVGZTGKMJOGEW-NOLJZWGESA-N
Data: 1 KI  2 IC50
Activity Spreadsheet -- Enzyme Inhibition Constant Data from BindingDB
Found 3 hits for monomerid = 50137257
Trg + Lig
Ki
nM
ΔG°
kcal/mole
IC50
nM
Kd
nM
EC50/IC50
nM
koff
s-1
kon
M-1s-1
pHTemp
°C
Potassium voltage-gated channel subfamily H member 2
(Homo sapiens (Human))
BDBM50137257
(1-[4-((S)-1-Amino-2-oxo-2-thiazolidin-3-yl-ethyl)-...)
Show SMILES [H][C@@]1(CC[C@@H](CC1)NC(=O)Nc1ccc(I)cc1)[C@H](N)C(=O)N1CCSC1 |wU:4.7,1.0,wD:18.20,(1.73,2.3,;3.06,1.54,;1.75,.76,;1.75,-.78,;3.06,-1.54,;4.39,-.78,;4.39,.76,;3.06,-3.08,;4.41,-3.85,;5.74,-3.08,;4.41,-5.39,;5.74,-6.16,;5.74,-7.7,;7.07,-8.47,;8.41,-7.7,;9.74,-8.47,;8.4,-6.14,;7.07,-5.39,;3.06,3.08,;1.73,3.85,;4.41,3.87,;4.41,5.41,;5.74,3.08,;7.15,3.71,;8.17,2.57,;7.4,1.23,;5.9,1.56,)|
Show InChI InChI=1S/C18H25IN4O2S/c19-13-3-7-15(8-4-13)22-18(25)21-14-5-1-12(2-6-14)16(20)17(24)23-9-10-26-11-23/h3-4,7-8,12,14,16H,1-2,5-6,9-11,20H2,(H2,21,22,25)/t12-,14-,16-/m0/s1
Reactome pathway
1.90E+3n/an/an/an/an/an/an/an/a
Merck & Co. Inc.
Curated by ChEMBL
Assay Description
Binding affinity for Potassium channel HERG Kv11.1
Bioorg Med Chem Lett 14: 43-6 (2003)
BindingDB Entry DOI: 10.7270/Q26972ZM
Dipeptidyl peptidase 4
(Homo sapiens (Human))
BDBM50137257
(1-[4-((S)-1-Amino-2-oxo-2-thiazolidin-3-yl-ethyl)-...)
Show SMILES [H][C@@]1(CC[C@@H](CC1)NC(=O)Nc1ccc(I)cc1)[C@H](N)C(=O)N1CCSC1 |wU:4.7,1.0,wD:18.20,(1.73,2.3,;3.06,1.54,;1.75,.76,;1.75,-.78,;3.06,-1.54,;4.39,-.78,;4.39,.76,;3.06,-3.08,;4.41,-3.85,;5.74,-3.08,;4.41,-5.39,;5.74,-6.16,;5.74,-7.7,;7.07,-8.47,;8.41,-7.7,;9.74,-8.47,;8.4,-6.14,;7.07,-5.39,;3.06,3.08,;1.73,3.85,;4.41,3.87,;4.41,5.41,;5.74,3.08,;7.15,3.71,;8.17,2.57,;7.4,1.23,;5.9,1.56,)|
Show InChI InChI=1S/C18H25IN4O2S/c19-13-3-7-15(8-4-13)22-18(25)21-14-5-1-12(2-6-14)16(20)17(24)23-9-10-26-11-23/h3-4,7-8,12,14,16H,1-2,5-6,9-11,20H2,(H2,21,22,25)/t12-,14-,16-/m0/s1
Reactome pathway
n/an/a 10n/an/an/an/an/an/a
Merck & Co. Inc.
Curated by ChEMBL
Assay Description
Inhibitory activity against dipeptidyl-peptidase IV.
Bioorg Med Chem Lett 14: 43-6 (2003)
BindingDB Entry DOI: 10.7270/Q26972ZM
Dipeptidyl peptidase 2 (DPP II)
(Homo sapiens (Human))
BDBM50137257
(1-[4-((S)-1-Amino-2-oxo-2-thiazolidin-3-yl-ethyl)-...)
Show SMILES [H][C@@]1(CC[C@@H](CC1)NC(=O)Nc1ccc(I)cc1)[C@H](N)C(=O)N1CCSC1 |wU:4.7,1.0,wD:18.20,(1.73,2.3,;3.06,1.54,;1.75,.76,;1.75,-.78,;3.06,-1.54,;4.39,-.78,;4.39,.76,;3.06,-3.08,;4.41,-3.85,;5.74,-3.08,;4.41,-5.39,;5.74,-6.16,;5.74,-7.7,;7.07,-8.47,;8.41,-7.7,;9.74,-8.47,;8.4,-6.14,;7.07,-5.39,;3.06,3.08,;1.73,3.85,;4.41,3.87,;4.41,5.41,;5.74,3.08,;7.15,3.71,;8.17,2.57,;7.4,1.23,;5.9,1.56,)|
Show InChI InChI=1S/C18H25IN4O2S/c19-13-3-7-15(8-4-13)22-18(25)21-14-5-1-12(2-6-14)16(20)17(24)23-9-10-26-11-23/h3-4,7-8,12,14,16H,1-2,5-6,9-11,20H2,(H2,21,22,25)/t12-,14-,16-/m0/s1
n/an/a 210n/an/an/an/an/an/a
Merck & Co. Inc.
Curated by ChEMBL
Assay Description
Inhibitory activity against quiescent cell prolyl peptidase (QPP).
Bioorg Med Chem Lett 14: 43-6 (2003)
BindingDB Entry DOI: 10.7270/Q26972ZM