BDBM50137270 CHEMBL3084938::N-[4-((S)-1-Amino-2-oxo-2-pyrrolidin-1-yl-ethyl)-cyclohexyl]-4-(3,3-dimethyl-ureido)-benzenesulfonamide
SMILES: [H][C@@]1(CC[C@@H](CC1)NS(=O)(=O)c1ccc(NC(=O)N(C)C)cc1)[C@H](N)C(=O)N1CCCC1
InChI Key: InChIKey=PEBCJHONXDFPDD-IEZWGBDMSA-N
Data: 1 KI  2 IC50
Activity Spreadsheet -- Enzyme Inhibition Constant Data from BindingDB
Found 3 hits for monomerid = 50137270
Trg + Lig
Ki
nM
ΔG°
kcal/mole
IC50
nM
Kd
nM
EC50/IC50
nM
koff
s-1
kon
M-1s-1
pHTemp
°C
Potassium voltage-gated channel subfamily H member 2
(Homo sapiens (Human))
BDBM50137270
(CHEMBL3084938 | N-[4-((S)-1-Amino-2-oxo-2-pyrrolid...)
Show SMILES [H][C@@]1(CC[C@@H](CC1)NS(=O)(=O)c1ccc(NC(=O)N(C)C)cc1)[C@H](N)C(=O)N1CCCC1 |wU:4.7,1.0,wD:23.25,(10.79,7.46,;12.14,6.7,;10.81,5.91,;10.81,4.36,;12.14,3.6,;13.47,4.36,;13.47,5.91,;12.14,2.06,;13.48,1.29,;13.48,-.26,;14.81,2.06,;14.81,.51,;16.12,1.29,;17.45,.53,;17.45,-1.03,;18.8,-1.8,;20.13,-1.03,;20.13,.51,;21.47,-1.8,;21.46,-3.34,;22.81,-1.03,;16.12,-1.78,;14.79,-1.01,;12.14,8.23,;10.8,9,;13.48,9.01,;13.48,10.55,;14.81,8.24,;14.97,6.7,;16.48,6.38,;17.26,7.72,;16.21,8.85,)|
Show InChI InChI=1S/C21H33N5O4S/c1-25(2)21(28)23-16-9-11-18(12-10-16)31(29,30)24-17-7-5-15(6-8-17)19(22)20(27)26-13-3-4-14-26/h9-12,15,17,19,24H,3-8,13-14,22H2,1-2H3,(H,23,28)/t15-,17-,19-/m0/s1
Reactome pathway
>1.00E+5n/an/an/an/an/an/an/an/a
Merck & Co. Inc.
Curated by ChEMBL
Assay Description
Binding affinity for Potassium channel HERG Kv11.1
Bioorg Med Chem Lett 14: 43-6 (2003)
BindingDB Entry DOI: 10.7270/Q26972ZM
Dipeptidyl peptidase 4
(Homo sapiens (Human))
BDBM50137270
(CHEMBL3084938 | N-[4-((S)-1-Amino-2-oxo-2-pyrrolid...)
Show SMILES [H][C@@]1(CC[C@@H](CC1)NS(=O)(=O)c1ccc(NC(=O)N(C)C)cc1)[C@H](N)C(=O)N1CCCC1 |wU:4.7,1.0,wD:23.25,(10.79,7.46,;12.14,6.7,;10.81,5.91,;10.81,4.36,;12.14,3.6,;13.47,4.36,;13.47,5.91,;12.14,2.06,;13.48,1.29,;13.48,-.26,;14.81,2.06,;14.81,.51,;16.12,1.29,;17.45,.53,;17.45,-1.03,;18.8,-1.8,;20.13,-1.03,;20.13,.51,;21.47,-1.8,;21.46,-3.34,;22.81,-1.03,;16.12,-1.78,;14.79,-1.01,;12.14,8.23,;10.8,9,;13.48,9.01,;13.48,10.55,;14.81,8.24,;14.97,6.7,;16.48,6.38,;17.26,7.72,;16.21,8.85,)|
Show InChI InChI=1S/C21H33N5O4S/c1-25(2)21(28)23-16-9-11-18(12-10-16)31(29,30)24-17-7-5-15(6-8-17)19(22)20(27)26-13-3-4-14-26/h9-12,15,17,19,24H,3-8,13-14,22H2,1-2H3,(H,23,28)/t15-,17-,19-/m0/s1
Reactome pathway
n/an/a 26n/an/an/an/an/an/a
Merck & Co. Inc.
Curated by ChEMBL
Assay Description
Inhibitory activity against dipeptidyl-peptidase IV.
Bioorg Med Chem Lett 14: 43-6 (2003)
BindingDB Entry DOI: 10.7270/Q26972ZM
Dipeptidyl peptidase 2 (DPP II)
(Homo sapiens (Human))
BDBM50137270
(CHEMBL3084938 | N-[4-((S)-1-Amino-2-oxo-2-pyrrolid...)
Show SMILES [H][C@@]1(CC[C@@H](CC1)NS(=O)(=O)c1ccc(NC(=O)N(C)C)cc1)[C@H](N)C(=O)N1CCCC1 |wU:4.7,1.0,wD:23.25,(10.79,7.46,;12.14,6.7,;10.81,5.91,;10.81,4.36,;12.14,3.6,;13.47,4.36,;13.47,5.91,;12.14,2.06,;13.48,1.29,;13.48,-.26,;14.81,2.06,;14.81,.51,;16.12,1.29,;17.45,.53,;17.45,-1.03,;18.8,-1.8,;20.13,-1.03,;20.13,.51,;21.47,-1.8,;21.46,-3.34,;22.81,-1.03,;16.12,-1.78,;14.79,-1.01,;12.14,8.23,;10.8,9,;13.48,9.01,;13.48,10.55,;14.81,8.24,;14.97,6.7,;16.48,6.38,;17.26,7.72,;16.21,8.85,)|
Show InChI InChI=1S/C21H33N5O4S/c1-25(2)21(28)23-16-9-11-18(12-10-16)31(29,30)24-17-7-5-15(6-8-17)19(22)20(27)26-13-3-4-14-26/h9-12,15,17,19,24H,3-8,13-14,22H2,1-2H3,(H,23,28)/t15-,17-,19-/m0/s1
n/an/a 1.20E+4n/an/an/an/an/an/a
Merck & Co. Inc.
Curated by ChEMBL
Assay Description
Inhibitory activity against quiescent cell prolyl peptidase (QPP).
Bioorg Med Chem Lett 14: 43-6 (2003)
BindingDB Entry DOI: 10.7270/Q26972ZM