null
SMILES: NC(=O)c1ccc(cc1O)-c1ccc(s1)-c1ccc2C(=O)OCc2c1
InChI Key: InChIKey=CZBUHFFVQRWPLQ-UHFFFAOYSA-N
Activity Spreadsheet -- Enzyme Inhibition Constant Data from BindingDB
Found 1 hit for monomerid = 50137379
Trg + Lig
Ki
nM
ΔG°
kcal/mole
IC50
nM
Kd
nM
EC50/IC50
nM
koff
s-1
kon
M-1s-1
pHTemp
°C
Perforin-1
(Homo sapiens (Human))
BDBM50137379
(CHEMBL3754407)
Show SMILES NC(=O)c1ccc(cc1O)-c1ccc(s1)-c1ccc2C(=O)OCc2c1
Show InChI InChI=1S/C19H13NO4S/c20-18(22)14-4-2-11(8-15(14)21)17-6-5-16(25-17)10-1-3-13-12(7-10)9-24-19(13)23/h1-8,21H,9H2,(H2,20,22)
NCI pathway
n/an/a 670n/an/an/an/an/an/a
University of Auckland
Curated by ChEMBL
Assay Description
Inhibition of recombinant perforin (unknown origin) mediated lysis of human Jurkat cells pre-incubated for 30 mins with perforin followed by incubati...
Bioorg Med Chem Lett 26: 355-60 (2016)
BindingDB Entry DOI: 10.7270/Q2B859ZN