BDBM50137392 CHEMBL99195::[(S)-1-((S)-1-Formyl-3-methylsulfanyl-propylcarbamoyl)-3-methyl-butyl]-carbamic acid benzyl ester::[1-(1-Formyl-3-methylsulfanyl-propylcarbamoyl)-3-methyl-butyl]-carbamic acid benzyl ester
SMILES: CSCC[C@H](NC(=O)[C@H](CC(C)C)NC(=O)OCc1ccccc1)C=O
InChI Key: InChIKey=RXCRNUBYZRKEGC-IRXDYDNUSA-N
Data: 1 KI  2 IC50
Activity Spreadsheet -- Enzyme Inhibition Constant Data from BindingDB
Found 3 hits for monomerid = 50137392
Trg + Lig
Ki
nM
ΔG°
kcal/mole
IC50
nM
Kd
nM
EC50/IC50
nM
koff
s-1
kon
M-1s-1
pHTemp
°C
Procathepsin L
(Homo sapiens (Human))
BDBM50137392
(CHEMBL99195 | [(S)-1-((S)-1-Formyl-3-methylsulfany...)
Show SMILES CSCC[C@H](NC(=O)[C@H](CC(C)C)NC(=O)OCc1ccccc1)C=O
Show InChI InChI=1S/C19H28N2O4S/c1-14(2)11-17(18(23)20-16(12-22)9-10-26-3)21-19(24)25-13-15-7-5-4-6-8-15/h4-8,12,14,16-17H,9-11,13H2,1-3H3,(H,20,23)(H,21,24)/t16-,17-/m0/s1
Reactome pathway
1.30n/an/an/an/an/an/an/an/a
Amgen Inc.
Curated by ChEMBL
Assay Description
Inhibitory activity against recombinant human cathepsin L
Bioorg Med Chem Lett 14: 87-90 (2003)
BindingDB Entry DOI: 10.7270/Q2930SKK
Procathepsin L
(Homo sapiens (Human))
BDBM50137392
(CHEMBL99195 | [(S)-1-((S)-1-Formyl-3-methylsulfany...)
Show SMILES CSCC[C@H](NC(=O)[C@H](CC(C)C)NC(=O)OCc1ccccc1)C=O
Show InChI InChI=1S/C19H28N2O4S/c1-14(2)11-17(18(23)20-16(12-22)9-10-26-3)21-19(24)25-13-15-7-5-4-6-8-15/h4-8,12,14,16-17H,9-11,13H2,1-3H3,(H,20,23)(H,21,24)/t16-,17-/m0/s1
Reactome pathway
n/an/a 5n/an/an/an/an/an/a
Amgen Inc.
Curated by ChEMBL
Assay Description
Inhibitory activity of the compound against recombinant human cathepsin L (1.2 nM)
Bioorg Med Chem Lett 14: 87-90 (2003)
BindingDB Entry DOI: 10.7270/Q2930SKK
Calpain1
(Homo sapiens (Human))
BDBM50137392
(CHEMBL99195 | [(S)-1-((S)-1-Formyl-3-methylsulfany...)
Show SMILES CSCC[C@H](NC(=O)[C@H](CC(C)C)NC(=O)OCc1ccccc1)C=O
Show InChI InChI=1S/C19H28N2O4S/c1-14(2)11-17(18(23)20-16(12-22)9-10-26-3)21-19(24)25-13-15-7-5-4-6-8-15/h4-8,12,14,16-17H,9-11,13H2,1-3H3,(H,20,23)(H,21,24)/t16-,17-/m0/s1
Reactome pathway
n/an/a 33n/an/an/an/an/an/a
TBA
Curated by ChEMBL
Assay Description
Inhibitory activity evaluated against recombinant human calpain 1
Bioorg Med Chem Lett 7: 539-544 (1997)
Article DOI: 10.1016/S0960-894X(97)00063-2
BindingDB Entry DOI: 10.7270/Q2W37WBM