BDBM50137404 Acetic acid (3R,4S,5S,6R)-5-methoxy-4-[(2R,3R)-2-methyl-3-(3-methyl-but-2-enyl)-oxiranyl]-1-oxa-spiro[2.5]oct-6-yl ester::CHEMBL172123
SMILES: [#6]-[#8]-[#6@@H]-1-[#6@@H](-[#6]-[#6][C@]2([#6]-[#8]2)[#6@H]-1[C@@]1([#6])[#8]-[#6@@H]1-[#6]\[#6]=[#6](/[#6])-[#6])-[#8]-[#6](-[#6])=O
InChI Key: InChIKey=WJWIELMYRJKFLK-WJQMWINMSA-N
Data: 1 IC50
Activity Spreadsheet -- Enzyme Inhibition Constant Data from BindingDB
Found 1 hit for monomerid = 50137404
Trg + Lig
Ki
nM
ΔG°
kcal/mole
IC50
nM
Kd
nM
EC50/IC50
nM
koff
s-1
kon
M-1s-1
pHTemp
°C
Methionine aminopeptidase 2
(Homo sapiens (Human))
BDBM50137404
(Acetic acid (3R,4S,5S,6R)-5-methoxy-4-[(2R,3R)-2-m...)
Show SMILES [#6]-[#8]-[#6@@H]-1-[#6@@H](-[#6]-[#6][C@]2([#6]-[#8]2)[#6@H]-1[C@@]1([#6])[#8]-[#6@@H]1-[#6]\[#6]=[#6](/[#6])-[#6])-[#8]-[#6](-[#6])=O
Show InChI InChI=1S/C18H28O5/c1-11(2)6-7-14-17(4,23-14)16-15(20-5)13(22-12(3)19)8-9-18(16)10-21-18/h6,13-16H,7-10H2,1-5H3/t13-,14-,15-,16-,17+,18+/m1/s1
Reactome pathway
n/an/a 0.510n/an/an/an/an/an/a
Gilead Sciences
Curated by ChEMBL
Assay Description
Inhibitory activity against Methionine aminopeptidase 2
Bioorg Med Chem Lett 14: 91-4 (2003)
BindingDB Entry DOI: 10.7270/Q27P8ZXD