BDBM50137456 CHEMBL3753271
SMILES: NC(=O)c1ccc(cn1)-c1ccc(s1)-c1ccc2C(=O)OCc2c1
InChI Key: InChIKey=ZHXKLRNCGNSIRI-UHFFFAOYSA-N
Data: 1 IC50
Activity Spreadsheet -- Enzyme Inhibition Constant Data from BindingDB
Found 1 hit for monomerid = 50137456
Trg + Lig
Ki
nM
ΔG°
kcal/mole
IC50
nM
Kd
nM
EC50/IC50
nM
koff
s-1
kon
M-1s-1
pHTemp
°C
Perforin-1
(Homo sapiens (Human))
BDBM50137456
(CHEMBL3753271)
Show SMILES NC(=O)c1ccc(cn1)-c1ccc(s1)-c1ccc2C(=O)OCc2c1
Show InChI InChI=1S/C18H12N2O3S/c19-17(21)14-4-2-11(8-20-14)16-6-5-15(24-16)10-1-3-13-12(7-10)9-23-18(13)22/h1-8H,9H2,(H2,19,21)
NCI pathway
n/an/a 920n/an/an/an/an/an/a
University of Auckland
Curated by ChEMBL
Assay Description
Inhibition of recombinant perforin (unknown origin) mediated lysis of human Jurkat cells pre-incubated for 30 mins with perforin followed by incubati...
Bioorg Med Chem Lett 26: 355-60 (2016)
BindingDB Entry DOI: 10.7270/Q2B859ZN