BDBM50137467 1-Cyclohexyl-2-thiophen-2-yl-1H-benzoimidazole-5-carboxylic acid::CHEMBL174629
SMILES: OC(=O)c1ccc2n(C3CCCCC3)c(nc2c1)-c1cccs1
InChI Key: InChIKey=RGWUXXSYHHASOS-UHFFFAOYSA-N
Data: 3 IC50
Activity Spreadsheet -- Enzyme Inhibition Constant Data from BindingDB
Found 3 hits for monomerid = 50137467
Trg + Lig
Ki
nM
ΔG°
kcal/mole
IC50
nM
Kd
nM
EC50/IC50
nM
koff
s-1
kon
M-1s-1
pHTemp
°C
Hepatitis C virus NS5B RNA-dependent RNA polymerase
(Hepatitis C virus)
BDBM50137467
(1-Cyclohexyl-2-thiophen-2-yl-1H-benzoimidazole-5-c...)
Show SMILES OC(=O)c1ccc2n(C3CCCCC3)c(nc2c1)-c1cccs1
Show InChI InChI=1S/C18H18N2O2S/c21-18(22)12-8-9-15-14(11-12)19-17(16-7-4-10-23-16)20(15)13-5-2-1-3-6-13/h4,7-11,13H,1-3,5-6H2,(H,21,22)
n/an/a 3.40E+3n/an/an/an/an/an/a
Boehringer Ingelheim (Canada) Ltd
Curated by ChEMBL
Assay Description
Inhibitory activity against NS5B polymerase of hepatitis C virus
Bioorg Med Chem Lett 14: 119-24 (2003)
BindingDB Entry DOI: 10.7270/Q21J9968
RNA polymerase subunit beta (β-RNAP)
(Escherichia coli)
BDBM50137467
(1-Cyclohexyl-2-thiophen-2-yl-1H-benzoimidazole-5-c...)
Show SMILES OC(=O)c1ccc2n(C3CCCCC3)c(nc2c1)-c1cccs1
Show InChI InChI=1S/C18H18N2O2S/c21-18(22)12-8-9-15-14(11-12)19-17(16-7-4-10-23-16)20(15)13-5-2-1-3-6-13/h4,7-11,13H,1-3,5-6H2,(H,21,22)
n/an/a>5.00E+5n/an/an/an/an/an/a
Boehringer Ingelheim (Canada) Ltd
Curated by ChEMBL
Assay Description
Inhibitory activity against calf thymus RNA polymerase
Bioorg Med Chem Lett 14: 119-24 (2003)
BindingDB Entry DOI: 10.7270/Q21J9968
Poliovirus type 1 polyprotein
(Poliovirus type 1 (strain Mahoney))
BDBM50137467
(1-Cyclohexyl-2-thiophen-2-yl-1H-benzoimidazole-5-c...)
Show SMILES OC(=O)c1ccc2n(C3CCCCC3)c(nc2c1)-c1cccs1
Show InChI InChI=1S/C18H18N2O2S/c21-18(22)12-8-9-15-14(11-12)19-17(16-7-4-10-23-16)20(15)13-5-2-1-3-6-13/h4,7-11,13H,1-3,5-6H2,(H,21,22)
n/an/a>2.50E+5n/an/an/an/an/an/a
Boehringer Ingelheim (Canada) Ltd
Curated by ChEMBL
Assay Description
Inhibitory activity against polio virus RNA polymerase
Bioorg Med Chem Lett 14: 119-24 (2003)
BindingDB Entry DOI: 10.7270/Q21J9968