BDBM50137474 2-Pyridin-2-yl-1H-benzoimidazole-5-carboxylic acid::CHEMBL174331
SMILES: OC(=O)c1ccc2nc([nH]c2c1)-c1ccccn1
InChI Key: InChIKey=HCHZJVIOJPDFKA-UHFFFAOYSA-N
Data: 1 IC50
Activity Spreadsheet -- Enzyme Inhibition Constant Data from BindingDB
Found 1 hit for monomerid = 50137474
Trg + Lig
Ki
nM
ΔG°
kcal/mole
IC50
nM
Kd
nM
EC50/IC50
nM
koff
s-1
kon
M-1s-1
pHTemp
°C
Hepatitis C virus NS5B RNA-dependent RNA polymerase
(Hepatitis C virus)
BDBM50137474
(2-Pyridin-2-yl-1H-benzoimidazole-5-carboxylic acid...)
Show SMILES OC(=O)c1ccc2nc([nH]c2c1)-c1ccccn1
Show InChI InChI=1S/C13H9N3O2/c17-13(18)8-4-5-9-11(7-8)16-12(15-9)10-3-1-2-6-14-10/h1-7H,(H,15,16)(H,17,18)
n/an/a>5.00E+5n/an/an/an/an/an/a
Boehringer Ingelheim (Canada) Ltd
Curated by ChEMBL
Assay Description
Inhibitory activity against NS5B polymerase of hepatitis C virus
Bioorg Med Chem Lett 14: 119-24 (2003)
BindingDB Entry DOI: 10.7270/Q21J9968