BDBM50137541 4-Fluoro-N-[3-(1-methyl-piperidin-4-yl)-furo[3,2-b]pyridin-5-yl]-benzamide::CHEMBL177258
SMILES: CN1CCC(CC1)c1coc2ccc(NC(=O)c3ccc(F)cc3)nc12
InChI Key: InChIKey=HRWIWORTVMTKLU-UHFFFAOYSA-N
Data: 1 KI  1 EC50
Activity Spreadsheet -- Enzyme Inhibition Constant Data from BindingDB
Found 2 hits for monomerid = 50137541
Trg + Lig
Ki
nM
ΔG°
kcal/mole
IC50
nM
Kd
nM
EC50/IC50
nM
koff
s-1
kon
M-1s-1
pHTemp
°C
Serotonin (5-HT) receptor
(Homo sapiens (Human))
BDBM50137541
(4-Fluoro-N-[3-(1-methyl-piperidin-4-yl)-furo[3,2-b...)
Show SMILES CN1CCC(CC1)c1coc2ccc(NC(=O)c3ccc(F)cc3)nc12
Show InChI InChI=1S/C20H20FN3O2/c1-24-10-8-13(9-11-24)16-12-26-17-6-7-18(22-19(16)17)23-20(25)14-2-4-15(21)5-3-14/h2-7,12-13H,8-11H2,1H3,(H,22,23,25)
Reactome pathway
3.10n/an/an/an/an/an/an/an/a
Lilly Research Laboratories
Curated by ChEMBL
Assay Description
Concentration required for stimulation of [35S]-GTP-gammaS, binding in mouse LM(tk-1) cells expressing the human 5-hydroxytryptamine 1F receptor
Bioorg Med Chem Lett 14: 167-70 (2003)
BindingDB Entry DOI: 10.7270/Q2S46RCF
Serotonin (5-HT) receptor
(Homo sapiens (Human))
BDBM50137541
(4-Fluoro-N-[3-(1-methyl-piperidin-4-yl)-furo[3,2-b...)
Show SMILES CN1CCC(CC1)c1coc2ccc(NC(=O)c3ccc(F)cc3)nc12
Show InChI InChI=1S/C20H20FN3O2/c1-24-10-8-13(9-11-24)16-12-26-17-6-7-18(22-19(16)17)23-20(25)14-2-4-15(21)5-3-14/h2-7,12-13H,8-11H2,1H3,(H,22,23,25)
Reactome pathway
n/an/an/an/a 66n/an/an/an/a
Lilly Research Laboratories
Curated by ChEMBL
Assay Description
Concentration required for stimulation of [35S]-GTP-gammaS, binding in mouse LM(tk-1) cells expressing the human 5-hydroxytryptamine 1F receptor
Bioorg Med Chem Lett 14: 167-70 (2003)
BindingDB Entry DOI: 10.7270/Q2S46RCF