BDBM50137586 3-{2-[5-Ethanesulfonyl-2-oxo-1,2-dihydro-indol-(3Z)-ylidenemethyl]-4,5,6,7-tetrahydro-1H-indol-3-yl}-propionic acid::CHEMBL294375
SMILES: CCS(=O)(=O)c1ccc2NC(=O)\C(=C/c3[nH]c4CCCCc4c3CCC(O)=O)c2c1
InChI Key: InChIKey=JSCOPDUWXRNDPX-ATVHPVEESA-N
Data: 1 IC50
Activity Spreadsheet -- Enzyme Inhibition Constant Data from BindingDB
Found 1 hit for monomerid = 50137586
Trg + Lig
Ki
nM
ΔG°
kcal/mole
IC50
nM
Kd
nM
EC50/IC50
nM
koff
s-1
kon
M-1s-1
pHTemp
°C
Proto-oncogene tyrosine-protein kinase Src
(Homo sapiens (Human))
BDBM50137586
(3-{2-[5-Ethanesulfonyl-2-oxo-1,2-dihydro-indol-(3Z...)
Show SMILES CCS(=O)(=O)c1ccc2NC(=O)\C(=C/c3[nH]c4CCCCc4c3CCC(O)=O)c2c1
Show InChI InChI=1S/C22H24N2O5S/c1-2-30(28,29)13-7-9-19-16(11-13)17(22(27)24-19)12-20-15(8-10-21(25)26)14-5-3-4-6-18(14)23-20/h7,9,11-12,23H,2-6,8,10H2,1H3,(H,24,27)(H,25,26)/b17-12-
n/an/a 400n/an/an/an/an/an/a
SUGEN, Inc.
Curated by ChEMBL
Assay Description
Inhibitory activity against Src protein tryrosine kinase
Bioorg Med Chem Lett 14: 187-90 (2003)
BindingDB Entry DOI: 10.7270/Q2HM57VG