BDBM50137592 3-[1-[3-(3-Dimethylamino-propyl)-4,5,6,7-tetrahydro-1H-indol-2-yl]-meth-(Z)-ylidene]-5-(propane-2-sulfonyl)-1,3-dihydro-indol-2-one::CHEMBL301676
SMILES: CC(C)S(=O)(=O)c1ccc2NC(=O)\C(=C/c3[nH]c4CCCCc4c3CCCN(C)C)c2c1
InChI Key: InChIKey=LRZXNDQFGPFXQR-QNGOZBTKSA-N
Data: 1 IC50
Activity Spreadsheet -- Enzyme Inhibition Constant Data from BindingDB
Found 1 hit for monomerid = 50137592
Trg + Lig
Ki
nM
ΔG°
kcal/mole
IC50
nM
Kd
nM
EC50/IC50
nM
koff
s-1
kon
M-1s-1
pHTemp
°C
Proto-oncogene tyrosine-protein kinase Src
(Homo sapiens (Human))
BDBM50137592
(3-[1-[3-(3-Dimethylamino-propyl)-4,5,6,7-tetrahydr...)
Show SMILES CC(C)S(=O)(=O)c1ccc2NC(=O)\C(=C/c3[nH]c4CCCCc4c3CCCN(C)C)c2c1
Show InChI InChI=1S/C25H33N3O3S/c1-16(2)32(30,31)17-11-12-23-20(14-17)21(25(29)27-23)15-24-19(9-7-13-28(3)4)18-8-5-6-10-22(18)26-24/h11-12,14-16,26H,5-10,13H2,1-4H3,(H,27,29)/b21-15-
n/an/a 230n/an/an/an/an/an/a
SUGEN, Inc.
Curated by ChEMBL
Assay Description
Inhibitory activity against Src protein tryrosine kinase
Bioorg Med Chem Lett 14: 187-90 (2003)
BindingDB Entry DOI: 10.7270/Q2HM57VG