BDBM50137605 3-[1-[3-(3-Dimethylamino-propyl)-4,5-dimethyl-1H-pyrrol-2-yl]-meth-(Z)-ylidene]-2-oxo-2,3-dihydro-1H-indole-5-sulfonic acid methylamide::CHEMBL56645
SMILES: CNS(=O)(=O)c1ccc2NC(=O)\C(=C/c3[nH]c(C)c(C)c3CCCN(C)C)c2c1
InChI Key: InChIKey=DTLDITKDSVDTMD-PDGQHHTCSA-N
Data: 1 IC50
Activity Spreadsheet -- Enzyme Inhibition Constant Data from BindingDB
Found 1 hit for monomerid = 50137605
Trg + Lig
Ki
nM
ΔG°
kcal/mole
IC50
nM
Kd
nM
EC50/IC50
nM
koff
s-1
kon
M-1s-1
pHTemp
°C
Proto-oncogene tyrosine-protein kinase Src
(Homo sapiens (Human))
BDBM50137605
(3-[1-[3-(3-Dimethylamino-propyl)-4,5-dimethyl-1H-p...)
Show SMILES CNS(=O)(=O)c1ccc2NC(=O)\C(=C/c3[nH]c(C)c(C)c3CCCN(C)C)c2c1
Show InChI InChI=1S/C21H28N4O3S/c1-13-14(2)23-20(16(13)7-6-10-25(4)5)12-18-17-11-15(29(27,28)22-3)8-9-19(17)24-21(18)26/h8-9,11-12,22-23H,6-7,10H2,1-5H3,(H,24,26)/b18-12-
n/an/a 1.00E+3n/an/an/an/an/an/a
SUGEN, Inc.
Curated by ChEMBL
Assay Description
Inhibitory activity against Src protein tryrosine kinase
Bioorg Med Chem Lett 14: 187-90 (2003)
BindingDB Entry DOI: 10.7270/Q2HM57VG