BDBM50137724 (3aR,5S)-2-((S)-3-Methyl-2-{(S)-3-methyl-2-[(pyrazine-2-carbonyl)-amino]-butyrylamino}-butyryl)-4-oxo-octahydro-cyclopenta[c]pyrrole-1-carboxylic acid (1-phenylaminooxalyl-butyl)-amide::CHEMBL264866
SMILES: CCCC(NC(=O)C1[C@H]2CCC(=O)[C@H]2CN1C(=O)[C@@H](NC(=O)[C@@H](NC(=O)c1cnccn1)C(C)C)C(C)C)C(=O)C(=O)Nc1ccccc1
InChI Key: InChIKey=WZPZYFJBLRHVOA-LZTKJBBBSA-N
Data: 1 KI  1 IC50
Activity Spreadsheet -- Enzyme Inhibition Constant Data from BindingDB
Found 2 hits for monomerid = 50137724
Trg + Lig
Ki
nM
ΔG°
kcal/mole
IC50
nM
Kd
nM
EC50/IC50
nM
koff
s-1
kon
M-1s-1
pHTemp
°C
Human rhinovirus A protease
(Human rhinovirus B)
BDBM50137724
((3aR,5S)-2-((S)-3-Methyl-2-{(S)-3-methyl-2-[(pyraz...)
Show SMILES CCCC(NC(=O)C1[C@H]2CCC(=O)[C@H]2CN1C(=O)[C@@H](NC(=O)[C@@H](NC(=O)c1cnccn1)C(C)C)C(C)C)C(=O)C(=O)Nc1ccccc1
Show InChI InChI=1S/C35H45N7O7/c1-6-10-24(30(44)34(48)38-21-11-8-7-9-12-21)39-33(47)29-22-13-14-26(43)23(22)18-42(29)35(49)28(20(4)5)41-32(46)27(19(2)3)40-31(45)25-17-36-15-16-37-25/h7-9,11-12,15-17,19-20,22-24,27-29H,6,10,13-14,18H2,1-5H3,(H,38,48)(H,39,47)(H,40,45)(H,41,46)/t22-,23-,24?,27-,28-,29?/m0/s1
17n/an/an/an/an/an/an/an/a
Lilly Research Laboratory
Curated by ChEMBL
Assay Description
Binding affinity towards Protease using PNA assay in rats
Bioorg Med Chem Lett 14: 251-6 (2003)
BindingDB Entry DOI: 10.7270/Q24B30R9
Human rhinovirus A protease
(Human rhinovirus B)
BDBM50137724
((3aR,5S)-2-((S)-3-Methyl-2-{(S)-3-methyl-2-[(pyraz...)
Show SMILES CCCC(NC(=O)C1[C@H]2CCC(=O)[C@H]2CN1C(=O)[C@@H](NC(=O)[C@@H](NC(=O)c1cnccn1)C(C)C)C(C)C)C(=O)C(=O)Nc1ccccc1
Show InChI InChI=1S/C35H45N7O7/c1-6-10-24(30(44)34(48)38-21-11-8-7-9-12-21)39-33(47)29-22-13-14-26(43)23(22)18-42(29)35(49)28(20(4)5)41-32(46)27(19(2)3)40-31(45)25-17-36-15-16-37-25/h7-9,11-12,15-17,19-20,22-24,27-29H,6,10,13-14,18H2,1-5H3,(H,38,48)(H,39,47)(H,40,45)(H,41,46)/t22-,23-,24?,27-,28-,29?/m0/s1
n/an/a>1.00E+5n/an/an/an/an/an/a
Lilly Research Laboratory
Curated by ChEMBL
Assay Description
Cytotoxic activity against Protease in rat liver Huh-7 cells
Bioorg Med Chem Lett 14: 251-6 (2003)
BindingDB Entry DOI: 10.7270/Q24B30R9