BDBM50137736 (1S,5S,6R)-2-((S)-3,3-Dimethyl-2-{(S)-3-methyl-2-[(pyrazine-2-carbonyl)-amino]-butyrylamino}-butyryl)-octahydro-cyclopenta[c]pyrrole-1-carboxylic acid [1-((S)-sec-butylaminooxalyl)-butyl]-amide::CHEMBL314777
SMILES: CCC[C@H](NC(=O)[C@@H]1[C@H]2CCC[C@H]2CN1C(=O)[C@@H](NC(=O)[C@@H](NC(=O)c1cnccn1)C(C)C)C(C)(C)C)C(=O)C(=O)NC(C)CC
InChI Key: InChIKey=VDTVFWIEFFGHNK-JJWLOOSDSA-N
Data: 4 KI  2 IC50
Activity Spreadsheet -- Enzyme Inhibition Constant Data from BindingDB
Found 6 hits for monomerid = 50137736
Trg + Lig
Ki
nM
ΔG°
kcal/mole
IC50
nM
Kd
nM
EC50/IC50
nM
koff
s-1
kon
M-1s-1
pHTemp
°C
Cathepsin B
(Homo sapiens (Human))
BDBM50137736
((1S,5S,6R)-2-((S)-3,3-Dimethyl-2-{(S)-3-methyl-2-[...)
Show SMILES CCC[C@H](NC(=O)[C@@H]1[C@H]2CCC[C@H]2CN1C(=O)[C@@H](NC(=O)[C@@H](NC(=O)c1cnccn1)C(C)C)C(C)(C)C)C(=O)C(=O)NC(C)CC
Show InChI InChI=1S/C34H53N7O6/c1-9-12-23(27(42)32(46)37-20(5)10-2)38-31(45)26-22-14-11-13-21(22)18-41(26)33(47)28(34(6,7)8)40-30(44)25(19(3)4)39-29(43)24-17-35-15-16-36-24/h15-17,19-23,25-26,28H,9-14,18H2,1-8H3,(H,37,46)(H,38,45)(H,39,43)(H,40,44)/t20?,21-,22-,23-,25-,26-,28+/m0/s1
Reactome pathway
3.70n/an/an/an/an/an/an/an/a
Lilly Research Laboratory
Curated by ChEMBL
Assay Description
Inhibitory activity of the compound against cathepsin B
Bioorg Med Chem Lett 14: 257-61 (2003)
BindingDB Entry DOI: 10.7270/Q20P0ZDG
Procathepsin L
(Homo sapiens (Human))
BDBM50137736
((1S,5S,6R)-2-((S)-3,3-Dimethyl-2-{(S)-3-methyl-2-[...)
Show SMILES CCC[C@H](NC(=O)[C@@H]1[C@H]2CCC[C@H]2CN1C(=O)[C@@H](NC(=O)[C@@H](NC(=O)c1cnccn1)C(C)C)C(C)(C)C)C(=O)C(=O)NC(C)CC
Show InChI InChI=1S/C34H53N7O6/c1-9-12-23(27(42)32(46)37-20(5)10-2)38-31(45)26-22-14-11-13-21(22)18-41(26)33(47)28(34(6,7)8)40-30(44)25(19(3)4)39-29(43)24-17-35-15-16-36-24/h15-17,19-23,25-26,28H,9-14,18H2,1-8H3,(H,37,46)(H,38,45)(H,39,43)(H,40,44)/t20?,21-,22-,23-,25-,26-,28+/m0/s1
Reactome pathway
52n/an/an/an/an/an/an/an/a
Lilly Research Laboratory
Curated by ChEMBL
Assay Description
Inhibitory activity of the compound against cathepsin L
Bioorg Med Chem Lett 14: 257-61 (2003)
BindingDB Entry DOI: 10.7270/Q20P0ZDG
Human rhinovirus A protease
(Human rhinovirus B)
BDBM50137736
((1S,5S,6R)-2-((S)-3,3-Dimethyl-2-{(S)-3-methyl-2-[...)
Show SMILES CCC[C@H](NC(=O)[C@@H]1[C@H]2CCC[C@H]2CN1C(=O)[C@@H](NC(=O)[C@@H](NC(=O)c1cnccn1)C(C)C)C(C)(C)C)C(=O)C(=O)NC(C)CC
Show InChI InChI=1S/C34H53N7O6/c1-9-12-23(27(42)32(46)37-20(5)10-2)38-31(45)26-22-14-11-13-21(22)18-41(26)33(47)28(34(6,7)8)40-30(44)25(19(3)4)39-29(43)24-17-35-15-16-36-24/h15-17,19-23,25-26,28H,9-14,18H2,1-8H3,(H,37,46)(H,38,45)(H,39,43)(H,40,44)/t20?,21-,22-,23-,25-,26-,28+/m0/s1
210n/an/an/an/an/an/an/an/a
Lilly Research Laboratory
Curated by ChEMBL
Assay Description
Binding affinity of the compound towards Protease using PNA assay in rats
Bioorg Med Chem Lett 14: 257-61 (2003)
BindingDB Entry DOI: 10.7270/Q20P0ZDG
Cathepsin K
(Homo sapiens (Human))
BDBM50137736
((1S,5S,6R)-2-((S)-3,3-Dimethyl-2-{(S)-3-methyl-2-[...)
Show SMILES CCC[C@H](NC(=O)[C@@H]1[C@H]2CCC[C@H]2CN1C(=O)[C@@H](NC(=O)[C@@H](NC(=O)c1cnccn1)C(C)C)C(C)(C)C)C(=O)C(=O)NC(C)CC
Show InChI InChI=1S/C34H53N7O6/c1-9-12-23(27(42)32(46)37-20(5)10-2)38-31(45)26-22-14-11-13-21(22)18-41(26)33(47)28(34(6,7)8)40-30(44)25(19(3)4)39-29(43)24-17-35-15-16-36-24/h15-17,19-23,25-26,28H,9-14,18H2,1-8H3,(H,37,46)(H,38,45)(H,39,43)(H,40,44)/t20?,21-,22-,23-,25-,26-,28+/m0/s1
Reactome pathway
1.06E+3n/an/an/an/an/an/an/an/a
Lilly Research Laboratory
Curated by ChEMBL
Assay Description
Inhibitory activity of the compound against cathepsin K
Bioorg Med Chem Lett 14: 257-61 (2003)
BindingDB Entry DOI: 10.7270/Q20P0ZDG
Human rhinovirus A protease
(Human rhinovirus B)
BDBM50137736
((1S,5S,6R)-2-((S)-3,3-Dimethyl-2-{(S)-3-methyl-2-[...)
Show SMILES CCC[C@H](NC(=O)[C@@H]1[C@H]2CCC[C@H]2CN1C(=O)[C@@H](NC(=O)[C@@H](NC(=O)c1cnccn1)C(C)C)C(C)(C)C)C(=O)C(=O)NC(C)CC
Show InChI InChI=1S/C34H53N7O6/c1-9-12-23(27(42)32(46)37-20(5)10-2)38-31(45)26-22-14-11-13-21(22)18-41(26)33(47)28(34(6,7)8)40-30(44)25(19(3)4)39-29(43)24-17-35-15-16-36-24/h15-17,19-23,25-26,28H,9-14,18H2,1-8H3,(H,37,46)(H,38,45)(H,39,43)(H,40,44)/t20?,21-,22-,23-,25-,26-,28+/m0/s1
n/an/a 3.48E+3n/an/an/an/an/an/a
Lilly Research Laboratory
Curated by ChEMBL
Assay Description
Inhibitory activity of the compound against Protease using replicon assay in rats at 25 microM concentration
Bioorg Med Chem Lett 14: 257-61 (2003)
BindingDB Entry DOI: 10.7270/Q20P0ZDG
Alpha-chymotrypsin
(Bos taurus (bovine))
BDBM50137736
((1S,5S,6R)-2-((S)-3,3-Dimethyl-2-{(S)-3-methyl-2-[...)
Show SMILES CCC[C@H](NC(=O)[C@@H]1[C@H]2CCC[C@H]2CN1C(=O)[C@@H](NC(=O)[C@@H](NC(=O)c1cnccn1)C(C)C)C(C)(C)C)C(=O)C(=O)NC(C)CC
Show InChI InChI=1S/C34H53N7O6/c1-9-12-23(27(42)32(46)37-20(5)10-2)38-31(45)26-22-14-11-13-21(22)18-41(26)33(47)28(34(6,7)8)40-30(44)25(19(3)4)39-29(43)24-17-35-15-16-36-24/h15-17,19-23,25-26,28H,9-14,18H2,1-8H3,(H,37,46)(H,38,45)(H,39,43)(H,40,44)/t20?,21-,22-,23-,25-,26-,28+/m0/s1
Reactome pathway
n/an/a>1.00E+5n/an/an/an/an/an/a
Lilly Research Laboratory
Curated by ChEMBL
Assay Description
Inhibitory activity of the compound against Chymotrypsin
Bioorg Med Chem Lett 14: 257-61 (2003)
BindingDB Entry DOI: 10.7270/Q20P0ZDG