BDBM50137826 8-Biphenyl-4-yl-8-oxo-octanoic acid (2-amino-phenyl)-amide::CHEMBL95213
SMILES: Nc1ccccc1NC(=O)CCCCCCC(=O)c1ccc(cc1)-c1ccccc1
InChI Key: InChIKey=GJRNLVQHVDGGNK-UHFFFAOYSA-N
Data: 1 IC50  1 EC50
Activity Spreadsheet -- Enzyme Inhibition Constant Data from BindingDB
Found 2 hits for monomerid = 50137826
Trg + Lig
Ki
nM
ΔG°
kcal/mole
IC50
nM
Kd
nM
EC50/IC50
nM
koff
s-1
kon
M-1s-1
pHTemp
°C
Histone deacetylase
(Homo sapiens (Human))
BDBM50137826
(8-Biphenyl-4-yl-8-oxo-octanoic acid (2-amino-pheny...)
Show SMILES Nc1ccccc1NC(=O)CCCCCCC(=O)c1ccc(cc1)-c1ccccc1
Show InChI InChI=1S/C26H28N2O2/c27-23-12-8-9-13-24(23)28-26(30)15-7-2-1-6-14-25(29)22-18-16-21(17-19-22)20-10-4-3-5-11-20/h3-5,8-13,16-19H,1-2,6-7,14-15,27H2,(H,28,30)
n/an/an/an/a 1.00E+4n/an/an/an/a
MethylGene Inc.
Curated by ChEMBL
Assay Description
Effect on induced hyperacetylation of histones in whole cells
Bioorg Med Chem Lett 14: 283-7 (2003)
BindingDB Entry DOI: 10.7270/Q2BV7G17
Histone deacetylase 1
(Homo sapiens (Human))
BDBM50137826
(8-Biphenyl-4-yl-8-oxo-octanoic acid (2-amino-pheny...)
Show SMILES Nc1ccccc1NC(=O)CCCCCCC(=O)c1ccc(cc1)-c1ccccc1
Show InChI InChI=1S/C26H28N2O2/c27-23-12-8-9-13-24(23)28-26(30)15-7-2-1-6-14-25(29)22-18-16-21(17-19-22)20-10-4-3-5-11-20/h3-5,8-13,16-19H,1-2,6-7,14-15,27H2,(H,28,30)
NCI pathway
Reactome pathway
n/an/a 2.00E+3n/an/an/an/an/an/a
MethylGene Inc.
Curated by ChEMBL
Assay Description
Ability to inhibit recombinant human histone deacetylase 1 (HDAC-1).
Bioorg Med Chem Lett 14: 283-7 (2003)
BindingDB Entry DOI: 10.7270/Q2BV7G17