BDBM50137841 6-(4-Oxo-4H-benzo[d][1,2,3]triazin-3-yl)-hexanoic acid (2-amino-phenyl)-amide::CHEMBL95869
SMILES: Nc1ccccc1NC(=O)CCCCCn1nnc2ccccc2c1=O
InChI Key: InChIKey=IDVVLGOKMHFUGB-UHFFFAOYSA-N
Data: 1 IC50  1 EC50
Activity Spreadsheet -- Enzyme Inhibition Constant Data from BindingDB
Found 2 hits for monomerid = 50137841
Trg + Lig
Ki
nM
ΔG°
kcal/mole
IC50
nM
Kd
nM
EC50/IC50
nM
koff
s-1
kon
M-1s-1
pHTemp
°C
Histone deacetylase
(Homo sapiens (Human))
BDBM50137841
(6-(4-Oxo-4H-benzo[d][1,2,3]triazin-3-yl)-hexanoic ...)
Show SMILES Nc1ccccc1NC(=O)CCCCCn1nnc2ccccc2c1=O
Show InChI InChI=1S/C19H21N5O2/c20-15-9-4-6-11-17(15)21-18(25)12-2-1-7-13-24-19(26)14-8-3-5-10-16(14)22-23-24/h3-6,8-11H,1-2,7,12-13,20H2,(H,21,25)
n/an/an/an/a 1.00E+4n/an/an/an/a
MethylGene Inc.
Curated by ChEMBL
Assay Description
Effect on induced hyperacetylation of histones in whole cells
Bioorg Med Chem Lett 14: 283-7 (2003)
BindingDB Entry DOI: 10.7270/Q2BV7G17
Histone deacetylase 1
(Homo sapiens (Human))
BDBM50137841
(6-(4-Oxo-4H-benzo[d][1,2,3]triazin-3-yl)-hexanoic ...)
Show SMILES Nc1ccccc1NC(=O)CCCCCn1nnc2ccccc2c1=O
Show InChI InChI=1S/C19H21N5O2/c20-15-9-4-6-11-17(15)21-18(25)12-2-1-7-13-24-19(26)14-8-3-5-10-16(14)22-23-24/h3-6,8-11H,1-2,7,12-13,20H2,(H,21,25)
NCI pathway
Reactome pathway
n/an/a 8.00E+3n/an/an/an/an/an/a
MethylGene Inc.
Curated by ChEMBL
Assay Description
Ability to inhibit recombinant human histone deacetylase 1 (HDAC-1).
Bioorg Med Chem Lett 14: 283-7 (2003)
BindingDB Entry DOI: 10.7270/Q2BV7G17