BDBM50137866 (Z)-4-[3-(3-Cyano-propoxy)-phenyl]-2-hydroxy-4-oxo-but-2-enoic acid::CHEMBL176543
SMILES: OC(=O)C(=O)CC(=O)c1cccc(OCCCC#N)c1
InChI Key: InChIKey=JKBNHUYJNDQBCV-UHFFFAOYSA-N
Data: 1 IC50
Activity Spreadsheet -- Enzyme Inhibition Constant Data from BindingDB
Found 1 hit for monomerid = 50137866
Trg + Lig
Ki
nM
ΔG°
kcal/mole
IC50
nM
Kd
nM
EC50/IC50
nM
koff
s-1
kon
M-1s-1
pHTemp
°C
Hepatitis C virus NS5B RNA-dependent RNA polymerase
(Hepatitis C virus)
BDBM50137866
((Z)-4-[3-(3-Cyano-propoxy)-phenyl]-2-hydroxy-4-oxo...)
Show SMILES OC(=O)C(=O)CC(=O)c1cccc(OCCCC#N)c1
Show InChI InChI=1S/C14H13NO5/c15-6-1-2-7-20-11-5-3-4-10(8-11)12(16)9-13(17)14(18)19/h3-5,8H,1-2,7,9H2,(H,18,19)
n/an/a 2.50E+3n/an/an/an/an/an/a
Italy. Vinc
Curated by ChEMBL
Assay Description
Inhibitory activity against Hepatitis C virus RNA dependent RNA polymerase nonstructural protein 5B
J Med Chem 47: 14-7 (2003)
Article DOI: 10.1021/jm0342109
BindingDB Entry DOI: 10.7270/Q2736QB8