BDBM50137868 (Z)-4-[3-(3-Cyano-benzyloxy)-phenyl]-2-hydroxy-4-oxo-but-2-enoic acid::CHEMBL177930
SMILES: OC(=O)C(=O)CC(=O)c1cccc(OCc2cccc(c2)C#N)c1
InChI Key: InChIKey=OXDQVGYGCLHKMY-UHFFFAOYSA-N
Data: 1 IC50
Activity Spreadsheet -- Enzyme Inhibition Constant Data from BindingDB
Found 1 hit for monomerid = 50137868
Trg + Lig
Ki
nM
ΔG°
kcal/mole
IC50
nM
Kd
nM
EC50/IC50
nM
koff
s-1
kon
M-1s-1
pHTemp
°C
Hepatitis C virus NS5B RNA-dependent RNA polymerase
(Hepatitis C virus)
BDBM50137868
((Z)-4-[3-(3-Cyano-benzyloxy)-phenyl]-2-hydroxy-4-o...)
Show SMILES OC(=O)C(=O)CC(=O)c1cccc(OCc2cccc(c2)C#N)c1
Show InChI InChI=1S/C18H13NO5/c19-10-12-3-1-4-13(7-12)11-24-15-6-2-5-14(8-15)16(20)9-17(21)18(22)23/h1-8H,9,11H2,(H,22,23)
n/an/a 6.70E+3n/an/an/an/an/an/a
Italy. Vinc
Curated by ChEMBL
Assay Description
Inhibitory activity against Hepatitis C virus RNA dependent RNA polymerase nonstructural protein 5B
J Med Chem 47: 14-7 (2003)
Article DOI: 10.1021/jm0342109
BindingDB Entry DOI: 10.7270/Q2736QB8