BDBM50137886 CHEMBL175036::{3'-[((R)-1-Phenyl-ethylcarbamoyl)-methyl]-biphenyl-4-sulfonyl}-acetic acid::{3'-[(1-(R)-Phenyl-ethylcarbamoyl)-methyl]-biphenyl-4-sulfonyl}-acetic acid
SMILES: C[C@@H](NC(=O)Cc1cccc(c1)-c1ccc(cc1)S(=O)(=O)CC(O)=O)c1ccccc1
InChI Key: InChIKey=BTZDSENLZFIOIZ-QGZVFWFLSA-N
Data: 1 IC50
Activity Spreadsheet -- Enzyme Inhibition Constant Data from BindingDB
Found 1 hit for monomerid = 50137886
Trg + Lig
Ki
nM
ΔG°
kcal/mole
IC50
nM
Kd
nM
EC50/IC50
nM
koff
s-1
kon
M-1s-1
pHTemp
°C
Replication protein E1
(Human papillomavirus type 11)
BDBM50137886
(CHEMBL175036 | {3'-[((R)-1-Phenyl-ethylcarbamoyl)-...)
Show SMILES C[C@@H](NC(=O)Cc1cccc(c1)-c1ccc(cc1)S(=O)(=O)CC(O)=O)c1ccccc1 |r|
Show InChI InChI=1S/C24H23NO5S/c1-17(19-7-3-2-4-8-19)25-23(26)15-18-6-5-9-21(14-18)20-10-12-22(13-11-20)31(29,30)16-24(27)28/h2-14,17H,15-16H2,1H3,(H,25,26)(H,27,28)/t17-/m1/s1
n/an/a 320n/an/an/an/an/an/a
Boehringer Ingelheim (Canada) Ltd.
Curated by ChEMBL
Assay Description
Ability to inhibit in vitro ATPase activity of human papillomavirus (HPV6) E1 helicase
J Med Chem 47: 18-21 (2003)
Article DOI: 10.1021/jm034206x
BindingDB Entry DOI: 10.7270/Q23F4P2Q