BDBM50137922 (3'-Methoxy-biphenyl-4-sulfonyl)-acetic acid::CHEMBL424958
SMILES: COc1cccc(c1)-c1ccc(cc1)S(=O)(=O)CC(O)=O
InChI Key: InChIKey=SZXSKZTUZDAGBB-UHFFFAOYSA-N
Data: 1 IC50
Activity Spreadsheet -- Enzyme Inhibition Constant Data from BindingDB
Found 1 hit for monomerid = 50137922
Trg + Lig
Ki
nM
ΔG°
kcal/mole
IC50
nM
Kd
nM
EC50/IC50
nM
koff
s-1
kon
M-1s-1
pHTemp
°C
Replication protein E1
(Human papillomavirus type 11)
BDBM50137922
((3'-Methoxy-biphenyl-4-sulfonyl)-acetic acid | CHE...)
Show SMILES COc1cccc(c1)-c1ccc(cc1)S(=O)(=O)CC(O)=O
Show InChI InChI=1S/C15H14O5S/c1-20-13-4-2-3-12(9-13)11-5-7-14(8-6-11)21(18,19)10-15(16)17/h2-9H,10H2,1H3,(H,16,17)
n/an/a 4.00E+3n/an/an/an/an/an/a
Boehringer Ingelheim (Canada) Ltd.
Curated by ChEMBL
Assay Description
Ability to inhibit in vitro ATPase activity of human papillomavirus (HPV6) E1 helicase
J Med Chem 47: 18-21 (2003)
Article DOI: 10.1021/jm034206x
BindingDB Entry DOI: 10.7270/Q23F4P2Q