null
SMILES: C[C@H]1CC(N)=N[C@@H]2[C@H](Cl)[C@H]12
InChI Key: InChIKey=SEVICIFJHBFRBO-OXVRIYFGSA-N
Activity Spreadsheet -- Enzyme Inhibition Constant Data from BindingDB
Found 2 hits for monomerid = 50138191
Trg + Lig
Ki
nM
ΔG°
kcal/mole
IC50
nM
Kd
nM
EC50/IC50
nM
koff
s-1
kon
M-1s-1
pHTemp
°C
Nitric oxide synthase, inducible
(Mus musculus (mouse))
BDBM50138191
((1S,5S,6R,7R)-7-Chloro-5-methyl-2-aza-bicyclo[4.1....)
Show SMILES C[C@H]1CC(N)=N[C@@H]2[C@H](Cl)[C@H]12 |c:4|
Show InChI InChI=1S/C7H11ClN2/c1-3-2-4(9)10-7-5(3)6(7)8/h3,5-7H,2H2,1H3,(H2,9,10)/t3-,5?,6+,7-/m0/s1
Reactome pathway
n/an/a 3n/an/an/an/an/an/a
Dainippon Pharmaceutical Co., Ltd
Curated by ChEMBL
Assay Description
Inhibition of inducible nitric oxide synthase (iNOS) in mice
Bioorg Med Chem Lett 14: 313-6 (2003)
BindingDB Entry DOI: 10.7270/Q2XP74C4
Nitric oxide synthase, brain
(Mus musculus)
BDBM50138191
((1S,5S,6R,7R)-7-Chloro-5-methyl-2-aza-bicyclo[4.1....)
Show SMILES C[C@H]1CC(N)=N[C@@H]2[C@H](Cl)[C@H]12 |c:4|
Show InChI InChI=1S/C7H11ClN2/c1-3-2-4(9)10-7-5(3)6(7)8/h3,5-7H,2H2,1H3,(H2,9,10)/t3-,5?,6+,7-/m0/s1
Reactome pathway
n/an/a 15n/an/an/an/an/an/a
Dainippon Pharmaceutical Co., Ltd
Curated by ChEMBL
Assay Description
Inhibition of neuronal nitric oxide synthase (nNOS) in mice
Bioorg Med Chem Lett 14: 313-6 (2003)
BindingDB Entry DOI: 10.7270/Q2XP74C4