BDBM50138471 3-(3,4-Dichloro-phenyl)-8-((S)-8-methoxy-2,3-dihydro-benzo[1,4]dioxin-2-ylmethyl)-8-aza-bicyclo[3.2.1]oct-2-ene::CHEMBL149776
SMILES: COc1cccc2OC[C@H](CN3C4CCC3C=C(C4)c3ccc(Cl)c(Cl)c3)Oc12
InChI Key: InChIKey=BHOQAPSNFDJZNW-ABHNRTSZSA-N
Data: 2 KI  1 IC50
Activity Spreadsheet -- Enzyme Inhibition Constant Data from BindingDB
Found 3 hits for monomerid = 50138471
Trg + Lig
Ki
nM
ΔG°
kcal/mole
IC50
nM
Kd
nM
EC50/IC50
nM
koff
s-1
kon
M-1s-1
pHTemp
°C
Sodium-dependent serotonin transporter
(Homo sapiens (Human))
BDBM50138471
(3-(3,4-Dichloro-phenyl)-8-((S)-8-methoxy-2,3-dihyd...)
Show SMILES COc1cccc2OC[C@H](CN3C4CCC3C=C(C4)c3ccc(Cl)c(Cl)c3)Oc12 |c:17|
Show InChI InChI=1S/C23H23Cl2NO3/c1-27-21-3-2-4-22-23(21)29-18(13-28-22)12-26-16-6-7-17(26)10-15(9-16)14-5-8-19(24)20(25)11-14/h2-5,8-9,11,16-18H,6-7,10,12-13H2,1H3/t16?,17?,18-/m0/s1
4.70n/an/an/an/an/an/an/an/a
Wyeth Research
Curated by ChEMBL
Assay Description
Inhibitory activity of compound against serotonin transport by RB5-5-HT transporter
Bioorg Med Chem Lett 14: 515-8 (2003)
BindingDB Entry DOI: 10.7270/Q247499J
Alpha-1 Adrenergic Receptor/ adrenergic receptor/ adrenergic receptor
(Rattus norvegicus (rat)-Rattus norvegicus (Rat))
BDBM50138471
(3-(3,4-Dichloro-phenyl)-8-((S)-8-methoxy-2,3-dihyd...)
Show SMILES COc1cccc2OC[C@H](CN3C4CCC3C=C(C4)c3ccc(Cl)c(Cl)c3)Oc12 |c:17|
Show InChI InChI=1S/C23H23Cl2NO3/c1-27-21-3-2-4-22-23(21)29-18(13-28-22)12-26-16-6-7-17(26)10-15(9-16)14-5-8-19(24)20(25)11-14/h2-5,8-9,11,16-18H,6-7,10,12-13H2,1H3/t16?,17?,18-/m0/s1
Reactome pathway
>1.00E+3n/an/an/an/an/an/an/an/a
Wyeth Research
Curated by ChEMBL
Assay Description
Inhibitory activity of compound against serotonin transport by HC5-5-HT transporter
Bioorg Med Chem Lett 14: 515-8 (2003)
BindingDB Entry DOI: 10.7270/Q247499J
Sodium-dependent serotonin transporter
(Homo sapiens (Human))
BDBM50138471
(3-(3,4-Dichloro-phenyl)-8-((S)-8-methoxy-2,3-dihyd...)
Show SMILES COc1cccc2OC[C@H](CN3C4CCC3C=C(C4)c3ccc(Cl)c(Cl)c3)Oc12 |c:17|
Show InChI InChI=1S/C23H23Cl2NO3/c1-27-21-3-2-4-22-23(21)29-18(13-28-22)12-26-16-6-7-17(26)10-15(9-16)14-5-8-19(24)20(25)11-14/h2-5,8-9,11,16-18H,6-7,10,12-13H2,1H3/t16?,17?,18-/m0/s1
n/an/a 260n/an/an/an/an/an/a
Wyeth Research
Curated by ChEMBL
Assay Description
Inhibitory activity of compound against serotonin transport by HC5-5-HT transporter
Bioorg Med Chem Lett 14: 515-8 (2003)
BindingDB Entry DOI: 10.7270/Q247499J