BDBM50138830 CHEMBL3752659::US10233190, Example 1415
SMILES: O[C@H](C[C@@H]1c2ccccc2-c2cncn12)C1CCCCC1
InChI Key: InChIKey=YTRRAUACYORZLX-SJLPKXTDSA-N
Data: 3 IC50
Activity Spreadsheet -- Enzyme Inhibition Constant Data from BindingDB
Found 3 hits for monomerid = 50138830
Trg + Lig
Ki
nM
ΔG°
kcal/mole
IC50
nM
Kd
nM
EC50/IC50
nM
koff
s-1
kon
M-1s-1
pHTemp
°C
Indoleamine 2,3-dioxygenase 1
(Homo sapiens (Human))
BDBM50138830
(CHEMBL3752659 | US10233190, Example 1415)
Show SMILES O[C@H](C[C@@H]1c2ccccc2-c2cncn12)C1CCCCC1 |r|
Show InChI InChI=1S/C18H22N2O/c21-18(13-6-2-1-3-7-13)10-16-14-8-4-5-9-15(14)17-11-19-12-20(16)17/h4-5,8-9,11-13,16,18,21H,1-3,6-7,10H2/t16-,18-/m1/s1
Reactome pathway
n/an/a 1.00E+3n/an/an/an/an/an/a
National Health Research Institutes
Curated by ChEMBL
Assay Description
Inhibition of recombinant human IDO1 expressed in M15(pREP4) cells using L-tryptophan as substrate assessed as conversion of N-formylkynurenine to ky...
J Med Chem 59: 282-93 (2016)
BindingDB Entry DOI: 10.7270/Q28917QW
Indoleamine 2,3-dioxygenase 1
(Homo sapiens (Human))
BDBM50138830
(CHEMBL3752659 | US10233190, Example 1415)
Show SMILES O[C@H](C[C@@H]1c2ccccc2-c2cncn12)C1CCCCC1 |r|
Show InChI InChI=1S/C18H22N2O/c21-18(13-6-2-1-3-7-13)10-16-14-8-4-5-9-15(14)17-11-19-12-20(16)17/h4-5,8-9,11-13,16,18,21H,1-3,6-7,10H2/t16-,18-/m1/s1
Reactome pathway
n/an/a>2.50E+4n/an/an/an/an/an/a
NewLink Genetics Corporation
Curated by ChEMBL
Assay Description
Inhibition of purified human IDO1 using L-tryptophan as substrate preincubated for 5 mins followed by substrate addition and measured after 15 mins b...
J Med Chem 62: 6705-6733 (2019)
Article DOI: 10.1021/acs.jmedchem.9b00662
Indoleamine 2,3-dioxygenase 1
(Homo sapiens (Human))
BDBM50138830
(CHEMBL3752659 | US10233190, Example 1415)
Show SMILES O[C@H](C[C@@H]1c2ccccc2-c2cncn12)C1CCCCC1 |r|
Show InChI InChI=1S/C18H22N2O/c21-18(13-6-2-1-3-7-13)10-16-14-8-4-5-9-15(14)17-11-19-12-20(16)17/h4-5,8-9,11-13,16,18,21H,1-3,6-7,10H2/t16-,18-/m1/s1
Reactome pathway
US Patent
n/an/a 550n/an/an/an/an/an/a
Bayer HealthCare Pharmaceuticals Corporation
Assay Description
The IC50 values for each compound were determined by testing the activity of IDO in a mixture containing 50 mM potassium phosphate buffer at pH 6.5; ...
J Med Chem 50: 984-1000 (2007)
BindingDB Entry DOI: 10.7270/Q26H4KQM