BDBM50139005 CHEMBL3753412
SMILES: NC1=Nc2nc3cc4OCCCOc4cc3n2C(N1)c1ccc(OCc2cn3ccccc3n2)cc1
InChI Key: InChIKey=YNNIPDFDZWDMRE-UHFFFAOYSA-N
Data: 1 IC50
Activity Spreadsheet -- Enzyme Inhibition Constant Data from BindingDB
Found 1 hit for monomerid = 50139005
Trg + Lig
Ki
nM
ΔG°
kcal/mole
IC50
nM
Kd
nM
EC50/IC50
nM
koff
s-1
kon
M-1s-1
pHTemp
°C
Mitogen-activated protein kinase 1
(Homo sapiens (Human))
BDBM50139005
(CHEMBL3753412)
Show SMILES NC1=Nc2nc3cc4OCCCOc4cc3n2C(N1)c1ccc(OCc2cn3ccccc3n2)cc1 |t:1|
Show InChI InChI=1S/C26H23N7O3/c27-25-30-24(33-20-13-22-21(34-10-3-11-35-22)12-19(20)29-26(33)31-25)16-5-7-18(8-6-16)36-15-17-14-32-9-2-1-4-23(32)28-17/h1-2,4-9,12-14,24H,3,10-11,15H2,(H3,27,29,30,31)
NCI pathway
Reactome pathway
n/an/a 4.70E+4n/an/an/an/an/an/a
Osaka Prefecture University
Curated by ChEMBL
Assay Description
Inhibition of ERK2 (unknown origin) by ELISA
Bioorg Med Chem Lett 26: 955-8 (2016)
BindingDB Entry DOI: 10.7270/Q24J0GZQ