BDBM50139198 4-(1-ethynyl)-23-oxo-8-oxa-1,15,17,21-tetraazapentacyclo[19.2.2.13,7.19,13.015,19]heptacosa-3(27),4,6,9(26),10,12,16,18-octaen-10-yl cyanide::CHEMBL423062
SMILES: O=C1CN2CCN1Cc1cc(Oc3cc(Cn4cncc4C2)ccc3C#N)ccc1C#C
InChI Key: InChIKey=QKFHVTMTAUFWNT-UHFFFAOYSA-N
Data: 3 IC50
Activity Spreadsheet -- Enzyme Inhibition Constant Data from BindingDB
Found 3 hits for monomerid = 50139198
Trg + Lig
Ki
nM
ΔG°
kcal/mole
IC50
nM
Kd
nM
EC50/IC50
nM
koff
s-1
kon
M-1s-1
pHTemp
°C
Geranylgeranyl transferase type I beta subunit/Protein Farnesyltransferase (PFT)
(Homo sapiens (Human))
BDBM50139198
(4-(1-ethynyl)-23-oxo-8-oxa-1,15,17,21-tetraazapent...)
Show SMILES O=C1CN2CCN1Cc1cc(Oc3cc(Cn4cncc4C2)ccc3C#N)ccc1C#C
Show InChI InChI=1S/C25H21N5O2/c1-2-19-5-6-23-10-21(19)14-29-8-7-28(16-25(29)31)15-22-12-27-17-30(22)13-18-3-4-20(11-26)24(9-18)32-23/h1,3-6,9-10,12,17H,7-8,13-16H2
n/an/a 212n/an/an/an/an/an/a
Merck Research Laboratories
Curated by ChEMBL
Assay Description
Inhibition of human Geranylgeranyl transferase type I incorporation of [3H]-GGPP into biotinylated peptide corresponding to the C-terminus of human K...
Bioorg Med Chem Lett 14: 639-43 (2004)
BindingDB Entry DOI: 10.7270/Q2WM1CTK
Protein Farnesyltransferase (PFT)
(Homo sapiens (Human))
BDBM50139198
(4-(1-ethynyl)-23-oxo-8-oxa-1,15,17,21-tetraazapent...)
Show SMILES O=C1CN2CCN1Cc1cc(Oc3cc(Cn4cncc4C2)ccc3C#N)ccc1C#C
Show InChI InChI=1S/C25H21N5O2/c1-2-19-5-6-23-10-21(19)14-29-8-7-28(16-25(29)31)15-22-12-27-17-30(22)13-18-3-4-20(11-26)24(9-18)32-23/h1,3-6,9-10,12,17H,7-8,13-16H2
Reactome pathway
n/an/a 1.40n/an/an/an/an/an/a
Merck Research Laboratories
Curated by ChEMBL
Assay Description
Displacement of radiolabeled FTI from Farnesyltransferase in cultured Ha-ras transformed RAT1 cells.
Bioorg Med Chem Lett 14: 639-43 (2004)
BindingDB Entry DOI: 10.7270/Q2WM1CTK
Protein Farnesyltransferase (PFT)
(Homo sapiens (Human))
BDBM50139198
(4-(1-ethynyl)-23-oxo-8-oxa-1,15,17,21-tetraazapent...)
Show SMILES O=C1CN2CCN1Cc1cc(Oc3cc(Cn4cncc4C2)ccc3C#N)ccc1C#C
Show InChI InChI=1S/C25H21N5O2/c1-2-19-5-6-23-10-21(19)14-29-8-7-28(16-25(29)31)15-22-12-27-17-30(22)13-18-3-4-20(11-26)24(9-18)32-23/h1,3-6,9-10,12,17H,7-8,13-16H2
Reactome pathway
n/an/a 0.5n/an/an/an/an/an/a
Merck Research Laboratories
Curated by ChEMBL
Assay Description
Inhibition of human Farnesyltransferase -catalyzed incorporation of [3H]-FPP into recombinant Ras-CVIM.
Bioorg Med Chem Lett 14: 639-43 (2004)
BindingDB Entry DOI: 10.7270/Q2WM1CTK