BDBM50139570 4-(5-{[2-(3,5-Difluoro-benzyl)-3-oxo-2,3,4,5-tetrahydro-1H-benzo[c]azepin-4-ylamino]-methyl}-imidazol-1-ylmethyl)-benzonitrile::CHEMBL350736
SMILES: Fc1cc(F)cc(CN2Cc3ccccc3CC(NCc3cncn3Cc3ccc(cc3)C#N)C2=O)c1
InChI Key: InChIKey=TWNBGUAWTJEEOF-UHFFFAOYSA-N
Data: 1 IC50
Activity Spreadsheet -- Enzyme Inhibition Constant Data from BindingDB
Found 1 hit for monomerid = 50139570
Trg + Lig
Ki
nM
ΔG°
kcal/mole
IC50
nM
Kd
nM
EC50/IC50
nM
koff
s-1
kon
M-1s-1
pHTemp
°C
Protein Farnesyltransferase (PFT)
(Homo sapiens (Human))
BDBM50139570
(4-(5-{[2-(3,5-Difluoro-benzyl)-3-oxo-2,3,4,5-tetra...)
Show SMILES Fc1cc(F)cc(CN2Cc3ccccc3CC(NCc3cncn3Cc3ccc(cc3)C#N)C2=O)c1
Show InChI InChI=1S/C29H25F2N5O/c30-25-9-22(10-26(31)12-25)17-35-18-24-4-2-1-3-23(24)11-28(29(35)37)34-15-27-14-33-19-36(27)16-21-7-5-20(13-32)6-8-21/h1-10,12,14,19,28,34H,11,15-18H2
Reactome pathway
n/an/a 8n/an/an/an/an/an/a
Institut de Recherches Servier
Curated by ChEMBL
Assay Description
Inhibition of farnesyltransferase
Bioorg Med Chem Lett 14: 767-71 (2004)
BindingDB Entry DOI: 10.7270/Q2348JSW