BDBM50139572 4-{5-[(2-Cyclohexylmethyl-3-oxo-2,3,4,5-tetrahydro-1H-benzo[c]azepin-4-ylamino)-methyl]-imidazol-1-ylmethyl}-benzonitrile::CHEMBL348850
SMILES: O=C1C(Cc2ccccc2CN1CC1CCCCC1)NCc1cncn1Cc1ccc(cc1)C#N
InChI Key: InChIKey=GERFWDRHAJVQRY-UHFFFAOYSA-N
Data: 1 IC50
Activity Spreadsheet -- Enzyme Inhibition Constant Data from BindingDB
Found 1 hit for monomerid = 50139572
Trg + Lig
Ki
nM
ΔG°
kcal/mole
IC50
nM
Kd
nM
EC50/IC50
nM
koff
s-1
kon
M-1s-1
pHTemp
°C
Protein Farnesyltransferase (PFT)
(Homo sapiens (Human))
BDBM50139572
(4-{5-[(2-Cyclohexylmethyl-3-oxo-2,3,4,5-tetrahydro...)
Show SMILES O=C1C(Cc2ccccc2CN1CC1CCCCC1)NCc1cncn1Cc1ccc(cc1)C#N
Show InChI InChI=1S/C29H33N5O/c30-15-22-10-12-24(13-11-22)19-34-21-31-16-27(34)17-32-28-14-25-8-4-5-9-26(25)20-33(29(28)35)18-23-6-2-1-3-7-23/h4-5,8-13,16,21,23,28,32H,1-3,6-7,14,17-20H2
Reactome pathway
n/an/a 47n/an/an/an/an/an/a
Institut de Recherches Servier
Curated by ChEMBL
Assay Description
Inhibition of farnesyltransferase
Bioorg Med Chem Lett 14: 767-71 (2004)
BindingDB Entry DOI: 10.7270/Q2348JSW