BDBM50139696 3-Benzyloxycarbonylamino-4-oxo-9-phenyl-nonanoic acid::CHEMBL167433
SMILES: OC(=O)CC(NC(=O)OCc1ccccc1)C(=O)CCCCCc1ccccc1
InChI Key: InChIKey=WJLXPMOYOTUARF-UHFFFAOYSA-N
Data: 1 KI  1 IC50
Activity Spreadsheet -- Enzyme Inhibition Constant Data from BindingDB
Found 2 hits for monomerid = 50139696
Trg + Lig
Ki
nM
ΔG°
kcal/mole
IC50
nM
Kd
nM
EC50/IC50
nM
koff
s-1
kon
M-1s-1
pHTemp
°C
Caspase-1
(Homo sapiens (Human))
BDBM50139696
(3-Benzyloxycarbonylamino-4-oxo-9-phenyl-nonanoic a...)
Show SMILES OC(=O)CC(NC(=O)OCc1ccccc1)C(=O)CCCCCc1ccccc1
Show InChI InChI=1S/C23H27NO5/c25-21(15-9-3-6-12-18-10-4-1-5-11-18)20(16-22(26)27)24-23(28)29-17-19-13-7-2-8-14-19/h1-2,4-5,7-8,10-11,13-14,20H,3,6,9,12,15-17H2,(H,24,28)(H,26,27)
NCI pathway
Reactome pathway
1.19E+5n/an/an/an/an/an/an/an/a
Pfizer Global Research and Development
Curated by ChEMBL
Assay Description
Inhibitory activity against caspase-1
Bioorg Med Chem Lett 14: 809-12 (2004)
BindingDB Entry DOI: 10.7270/Q2FB52CR
Caspase
(Homo sapiens (Human))
BDBM50139696
(3-Benzyloxycarbonylamino-4-oxo-9-phenyl-nonanoic a...)
Show SMILES OC(=O)CC(NC(=O)OCc1ccccc1)C(=O)CCCCCc1ccccc1
Show InChI InChI=1S/C23H27NO5/c25-21(15-9-3-6-12-18-10-4-1-5-11-18)20(16-22(26)27)24-23(28)29-17-19-13-7-2-8-14-19/h1-2,4-5,7-8,10-11,13-14,20H,3,6,9,12,15-17H2,(H,24,28)(H,26,27)
NCI pathway
Reactome pathway
n/an/a 1.03E+6n/an/an/an/an/an/a
Pfizer Global Research and Development
Curated by ChEMBL
Assay Description
Inhibitory activity against caspase-1
Bioorg Med Chem Lett 14: 809-12 (2004)
BindingDB Entry DOI: 10.7270/Q2FB52CR