BDBM50139698 3-Benzyloxycarbonylamino-4-oxo-5-(2-phenyl-ethanesulfonylamino)-pentanoic acid::CHEMBL422379
SMILES: OC(=O)CC(NC(=O)OCc1ccccc1)C(=O)CNS(=O)(=O)CCc1ccccc1
InChI Key: InChIKey=LPNMHHHHHHDQDN-UHFFFAOYSA-N
Data: 1 KI  1 IC50
Activity Spreadsheet -- Enzyme Inhibition Constant Data from BindingDB
Found 2 hits for monomerid = 50139698
Trg + Lig
Ki
nM
ΔG°
kcal/mole
IC50
nM
Kd
nM
EC50/IC50
nM
koff
s-1
kon
M-1s-1
pHTemp
°C
Caspase-1
(Homo sapiens (Human))
BDBM50139698
(3-Benzyloxycarbonylamino-4-oxo-5-(2-phenyl-ethanes...)
Show SMILES OC(=O)CC(NC(=O)OCc1ccccc1)C(=O)CNS(=O)(=O)CCc1ccccc1
Show InChI InChI=1S/C21H24N2O7S/c24-19(14-22-31(28,29)12-11-16-7-3-1-4-8-16)18(13-20(25)26)23-21(27)30-15-17-9-5-2-6-10-17/h1-10,18,22H,11-15H2,(H,23,27)(H,25,26)
NCI pathway
Reactome pathway
1.10E+4n/an/an/an/an/an/an/an/a
Pfizer Global Research and Development
Curated by ChEMBL
Assay Description
Inhibitory activity against caspase-1
Bioorg Med Chem Lett 14: 809-12 (2004)
BindingDB Entry DOI: 10.7270/Q2FB52CR
Caspase-1
(Homo sapiens (Human))
BDBM50139698
(3-Benzyloxycarbonylamino-4-oxo-5-(2-phenyl-ethanes...)
Show SMILES OC(=O)CC(NC(=O)OCc1ccccc1)C(=O)CNS(=O)(=O)CCc1ccccc1
Show InChI InChI=1S/C21H24N2O7S/c24-19(14-22-31(28,29)12-11-16-7-3-1-4-8-16)18(13-20(25)26)23-21(27)30-15-17-9-5-2-6-10-17/h1-10,18,22H,11-15H2,(H,23,27)(H,25,26)
NCI pathway
Reactome pathway
n/an/a 7.30E+4n/an/an/an/an/an/a
Pfizer Global Research and Development
Curated by ChEMBL
Assay Description
Inhibitory activity against caspase-1
Bioorg Med Chem Lett 14: 809-12 (2004)
BindingDB Entry DOI: 10.7270/Q2FB52CR