BDBM50140094 CCSHPACAANNQDYC*::CHEMBL262475
SMILES: C[C@H](NC(=O)[C@H](C)NC(=O)[C@H](CS)NC(=O)[C@H](C)NC(=O)[C@H]1CCCN1C(=O)[C@H](Cc1cnc[nH]1)NC(=O)[C@H](CO)NC(=O)[C@H](CS)NC(=O)[C@@H](N)CS)C(=O)N[C@@H](CC(N)=O)C(=O)N[C@@H](CC(N)=O)C(=O)N[C@@H](CCC(N)=O)C(=O)N[C@@H](CC(O)=O)C(=O)N[C@@H](Cc1ccc(O)cc1)C(=O)N[C@@H](CS)C(N)=O
InChI Key: InChIKey=AILIMXLQDAOMKD-RYWOIVIGSA-N
Data: 1 IC50
Activity Spreadsheet -- Enzyme Inhibition Constant Data from BindingDB
Found 1 hit for monomerid = 50140094
Trg + Lig
Ki
nM
ΔG°
kcal/mole
IC50
nM
Kd
nM
EC50/IC50
nM
koff
s-1
kon
M-1s-1
pHTemp
°C
Neuronal acetylcholine receptor Alpha-3/Beta-2
(Rattus norvegicus (Rat))
BDBM50140094
(CCSHPACAANNQDYC* | CHEMBL262475)
Show SMILES C[C@H](NC(=O)[C@H](C)NC(=O)[C@H](CS)NC(=O)[C@H](C)NC(=O)[C@H]1CCCN1C(=O)[C@H](Cc1cnc[nH]1)NC(=O)[C@H](CO)NC(=O)[C@H](CS)NC(=O)[C@@H](N)CS)C(=O)N[C@@H](CC(N)=O)C(=O)N[C@@H](CC(N)=O)C(=O)N[C@@H](CCC(N)=O)C(=O)N[C@@H](CC(O)=O)C(=O)N[C@@H](Cc1ccc(O)cc1)C(=O)N[C@@H](CS)C(N)=O
Show InChI InChI=1S/C61H91N21O22S4/c1-25(70-58(101)40(22-107)80-50(93)27(3)71-60(103)42-5-4-12-82(42)61(104)37(14-29-18-67-24-68-29)77-57(100)38(19-83)78-59(102)41(23-108)81-51(94)31(62)20-105)48(91)69-26(2)49(92)73-34(15-44(64)86)55(98)75-35(16-45(65)87)54(97)72-32(10-11-43(63)85)52(95)76-36(17-46(88)89)56(99)74-33(13-28-6-8-30(84)9-7-28)53(96)79-39(21-106)47(66)90/h6-9,18,24-27,31-42,83-84,105-108H,4-5,10-17,19-23,62H2,1-3H3,(H2,63,85)(H2,64,86)(H2,65,87)(H2,66,90)(H,67,68)(H,69,91)(H,70,101)(H,71,103)(H,72,97)(H,73,92)(H,74,99)(H,75,98)(H,76,95)(H,77,100)(H,78,102)(H,79,96)(H,80,93)(H,81,94)(H,88,89)/t25-,26-,27-,31-,32-,33-,34-,35-,36-,37-,38-,39-,40-,41-,42+/m0/s1
NCI pathway
Reactome pathway
n/an/a 5.84n/an/an/an/an/an/a
The University of Queensland
Curated by ChEMBL
Assay Description
Inhibition of rat Nicotinic acetylcholine receptor alpha3-beta2 expressed in Xenopus Oocytes
J Med Chem 47: 1234-41 (2004)
Article DOI: 10.1021/jm031010o
BindingDB Entry DOI: 10.7270/Q2RN378M