BDBM50140353 2-(6-Chloro-naphthalen-2-yl)-5-methyl-2H-pyrazole-3-carboxylic acid [4-(7-oxo-[1,4]diazepan-1-yl)-phenyl]-amide::CHEMBL20413
SMILES: Cc1cc(C(=O)Nc2ccc(cc2)N2CCNCCC2=O)n(n1)-c1ccc2cc(Cl)ccc2c1
InChI Key: InChIKey=VSODADSYPYIUCR-UHFFFAOYSA-N
Data: 1 IC50
Activity Spreadsheet -- Enzyme Inhibition Constant Data from BindingDB
Found 1 hit for monomerid = 50140353
Trg + Lig
Ki
nM
ΔG°
kcal/mole
IC50
nM
Kd
nM
EC50/IC50
nM
koff
s-1
kon
M-1s-1
pHTemp
°C
Coagulation factor X
(Homo sapiens (Human))
BDBM50140353
(2-(6-Chloro-naphthalen-2-yl)-5-methyl-2H-pyrazole-...)
Show SMILES Cc1cc(C(=O)Nc2ccc(cc2)N2CCNCCC2=O)n(n1)-c1ccc2cc(Cl)ccc2c1
Show InChI InChI=1S/C26H24ClN5O2/c1-17-14-24(32(30-17)23-7-3-18-15-20(27)4-2-19(18)16-23)26(34)29-21-5-8-22(9-6-21)31-13-12-28-11-10-25(31)33/h2-9,14-16,28H,10-13H2,1H3,(H,29,34)
Reactome pathway
n/an/a 130n/an/an/an/an/an/a
Millennium Pharmaceuticals Inc.
Curated by ChEMBL
Assay Description
Inhibitory concentration against human Coagulation factor X
Bioorg Med Chem Lett 14: 1221-7 (2004)
Article DOI: 10.1016/j.bmcl.2003.12.053
BindingDB Entry DOI: 10.7270/Q2VD6XV5