BDBM50140371 2-(3-Fluoro-naphthalen-2-yl)-5-methyl-2H-pyrazole-3-carboxylic acid [2-fluoro-4-(3-oxo-morpholin-4-yl)-phenyl]-amide::CHEMBL21125
SMILES: Cc1cc(C(=O)Nc2ccc(cc2F)N2CCOCC2=O)n(n1)-c1cc2ccccc2cc1F
InChI Key: InChIKey=RSFAKFNRGNVKNY-UHFFFAOYSA-N
Data: 1 KI  1 IC50
Activity Spreadsheet -- Enzyme Inhibition Constant Data from BindingDB
Found 2 hits for monomerid = 50140371
Trg + Lig
Ki
nM
ΔG°
kcal/mole
IC50
nM
Kd
nM
EC50/IC50
nM
koff
s-1
kon
M-1s-1
pHTemp
°C
Coagulation factor X
(Homo sapiens (Human))
BDBM50140371
(2-(3-Fluoro-naphthalen-2-yl)-5-methyl-2H-pyrazole-...)
Show SMILES Cc1cc(C(=O)Nc2ccc(cc2F)N2CCOCC2=O)n(n1)-c1cc2ccccc2cc1F
Show InChI InChI=1S/C25H20F2N4O3/c1-15-10-23(31(29-15)22-12-17-5-3-2-4-16(17)11-20(22)27)25(33)28-21-7-6-18(13-19(21)26)30-8-9-34-14-24(30)32/h2-7,10-13H,8-9,14H2,1H3,(H,28,33)
Reactome pathway
0.5n/an/an/an/an/an/an/an/a
Millennium Pharmaceuticals Inc.
Curated by ChEMBL
Assay Description
Binding affinity against Coagulation factor X
Bioorg Med Chem Lett 14: 1221-7 (2004)
Article DOI: 10.1016/j.bmcl.2003.12.053
BindingDB Entry DOI: 10.7270/Q2VD6XV5
Coagulation factor X
(Homo sapiens (Human))
BDBM50140371
(2-(3-Fluoro-naphthalen-2-yl)-5-methyl-2H-pyrazole-...)
Show SMILES Cc1cc(C(=O)Nc2ccc(cc2F)N2CCOCC2=O)n(n1)-c1cc2ccccc2cc1F
Show InChI InChI=1S/C25H20F2N4O3/c1-15-10-23(31(29-15)22-12-17-5-3-2-4-16(17)11-20(22)27)25(33)28-21-7-6-18(13-19(21)26)30-8-9-34-14-24(30)32/h2-7,10-13H,8-9,14H2,1H3,(H,28,33)
Reactome pathway
n/an/a 2n/an/an/an/an/an/a
Millennium Pharmaceuticals Inc.
Curated by ChEMBL
Assay Description
Inhibitory concentration against human Coagulation factor X
Bioorg Med Chem Lett 14: 1221-7 (2004)
Article DOI: 10.1016/j.bmcl.2003.12.053
BindingDB Entry DOI: 10.7270/Q2VD6XV5