BDBM50140389 2-(6-Chloro-naphthalen-2-yl)-5-methyl-2H-pyrazole-3-carboxylic acid (4-pyrazol-1-yl-phenyl)-amide::CHEMBL20475
SMILES: Cc1cc(C(=O)Nc2ccc(cc2)-n2cccn2)n(n1)-c1ccc2cc(Cl)ccc2c1
InChI Key: InChIKey=JTHRJNXNZOXKAE-UHFFFAOYSA-N
Data: 1 IC50
Activity Spreadsheet -- Enzyme Inhibition Constant Data from BindingDB
Found 1 hit for monomerid = 50140389
Trg + Lig
Ki
nM
ΔG°
kcal/mole
IC50
nM
Kd
nM
EC50/IC50
nM
koff
s-1
kon
M-1s-1
pHTemp
°C
Coagulation factor X
(Homo sapiens (Human))
BDBM50140389
(2-(6-Chloro-naphthalen-2-yl)-5-methyl-2H-pyrazole-...)
Show SMILES Cc1cc(C(=O)Nc2ccc(cc2)-n2cccn2)n(n1)-c1ccc2cc(Cl)ccc2c1
Show InChI InChI=1S/C24H18ClN5O/c1-16-13-23(24(31)27-20-6-9-21(10-7-20)29-12-2-11-26-29)30(28-16)22-8-4-17-14-19(25)5-3-18(17)15-22/h2-15H,1H3,(H,27,31)
Reactome pathway
n/an/a 215n/an/an/an/an/an/a
Millennium Pharmaceuticals Inc.
Curated by ChEMBL
Assay Description
Inhibitory concentration against human Coagulation factor X
Bioorg Med Chem Lett 14: 1221-7 (2004)
Article DOI: 10.1016/j.bmcl.2003.12.053
BindingDB Entry DOI: 10.7270/Q2VD6XV5