BDBM50140392 2-(6-Chloro-naphthalen-2-yl)-5-methyl-2H-pyrazole-3-carboxylic acid (3'-carbamimidoyl-biphenyl-4-yl)-amide::CHEMBL21197
SMILES: Cc1cc(C(=O)Nc2ccc(cc2)-c2cccc(c2)C(N)=N)n(n1)-c1ccc2cc(Cl)ccc2c1
InChI Key: InChIKey=MHBRNQSAJVURDJ-UHFFFAOYSA-N
Data: 1 IC50
Activity Spreadsheet -- Enzyme Inhibition Constant Data from BindingDB
Found 1 hit for monomerid = 50140392
Trg + Lig
Ki
nM
ΔG°
kcal/mole
IC50
nM
Kd
nM
EC50/IC50
nM
koff
s-1
kon
M-1s-1
pHTemp
°C
Coagulation factor X
(Homo sapiens (Human))
BDBM50140392
(2-(6-Chloro-naphthalen-2-yl)-5-methyl-2H-pyrazole-...)
Show SMILES Cc1cc(C(=O)Nc2ccc(cc2)-c2cccc(c2)C(N)=N)n(n1)-c1ccc2cc(Cl)ccc2c1
Show InChI InChI=1S/C28H22ClN5O/c1-17-13-26(34(33-17)25-12-8-20-15-23(29)9-5-21(20)16-25)28(35)32-24-10-6-18(7-11-24)19-3-2-4-22(14-19)27(30)31/h2-16H,1H3,(H3,30,31)(H,32,35)
Reactome pathway
n/an/a 75n/an/an/an/an/an/a
Millennium Pharmaceuticals Inc.
Curated by ChEMBL
Assay Description
Inhibitory concentration against human Coagulation factor X
Bioorg Med Chem Lett 14: 1221-7 (2004)
Article DOI: 10.1016/j.bmcl.2003.12.053
BindingDB Entry DOI: 10.7270/Q2VD6XV5