BDBM50140425 2-(3-Fluoro-naphthalen-2-yl)-5-methyl-2H-pyrazole-3-carboxylic acid [4-(N-benzyl-N-methyl-carbamimidoyl)-2-fluoro-phenyl]-amide::CHEMBL280336
SMILES: CN(Cc1ccccc1)C(=N)c1ccc(NC(=O)c2cc(C)nn2-c2cc3ccccc3cc2F)c(F)c1
InChI Key: InChIKey=HKEIZDYCHZJQBJ-UHFFFAOYSA-N
Data: 1 IC50
Activity Spreadsheet -- Enzyme Inhibition Constant Data from BindingDB
Found 1 hit for monomerid = 50140425
Trg + Lig
Ki
nM
ΔG°
kcal/mole
IC50
nM
Kd
nM
EC50/IC50
nM
koff
s-1
kon
M-1s-1
pHTemp
°C
Coagulation factor X
(Homo sapiens (Human))
BDBM50140425
(2-(3-Fluoro-naphthalen-2-yl)-5-methyl-2H-pyrazole-...)
Show SMILES CN(Cc1ccccc1)C(=N)c1ccc(NC(=O)c2cc(C)nn2-c2cc3ccccc3cc2F)c(F)c1
Show InChI InChI=1S/C30H25F2N5O/c1-19-14-28(37(35-19)27-17-22-11-7-6-10-21(22)15-25(27)32)30(38)34-26-13-12-23(16-24(26)31)29(33)36(2)18-20-8-4-3-5-9-20/h3-17,33H,18H2,1-2H3,(H,34,38)
Reactome pathway
n/an/a 80n/an/an/an/an/an/a
Millennium Pharmaceuticals Inc.
Curated by ChEMBL
Assay Description
In vitro inhibitory activity against human coagulation factor X
Bioorg Med Chem Lett 14: 1229-34 (2004)
Article DOI: 10.1016/j.bmcl.2003.12.054
BindingDB Entry DOI: 10.7270/Q2QN6664