BDBM50140435 1-(6-Chloro-naphthalen-2-yl)-1H-tetrazole-5-carboxylic acid [2-fluoro-4-(1-methyl-4,5-dihydro-1H-imidazol-2-yl)-phenyl]-amide::CHEMBL418558
SMILES: CN1CCN=C1c1ccc(NC(=O)c2nnnn2-c2ccc3cc(Cl)ccc3c2)c(F)c1
InChI Key: InChIKey=GBDXFRGPUGGDMZ-UHFFFAOYSA-N
Data: 1 IC50
Activity Spreadsheet -- Enzyme Inhibition Constant Data from BindingDB
Found 1 hit for monomerid = 50140435
Trg + Lig
Ki
nM
ΔG°
kcal/mole
IC50
nM
Kd
nM
EC50/IC50
nM
koff
s-1
kon
M-1s-1
pHTemp
°C
Coagulation factor X
(Homo sapiens (Human))
BDBM50140435
(1-(6-Chloro-naphthalen-2-yl)-1H-tetrazole-5-carbox...)
Show SMILES CN1CCN=C1c1ccc(NC(=O)c2nnnn2-c2ccc3cc(Cl)ccc3c2)c(F)c1 |c:4|
Show InChI InChI=1S/C22H17ClFN7O/c1-30-9-8-25-20(30)15-4-7-19(18(24)12-15)26-22(32)21-27-28-29-31(21)17-6-3-13-10-16(23)5-2-14(13)11-17/h2-7,10-12H,8-9H2,1H3,(H,26,32)
Reactome pathway
n/an/a 15n/an/an/an/an/an/a
Millennium Pharmaceuticals Inc.
Curated by ChEMBL
Assay Description
In vitro inhibitory activity against human coagulation factor X
Bioorg Med Chem Lett 14: 1229-34 (2004)
Article DOI: 10.1016/j.bmcl.2003.12.054
BindingDB Entry DOI: 10.7270/Q2QN6664