BDBM50140436 2-(3-Fluoro-naphthalen-2-yl)-5-methyl-2H-pyrazole-3-carboxylic acid [5-(N,N-dimethyl-carbamimidoyl)-thiophen-2-yl]-amide::CHEMBL20651
SMILES: CN(C)C(=N)c1ccc(NC(=O)c2cc(C)nn2-c2cc3ccccc3cc2F)s1
InChI Key: InChIKey=NQJIMQBBJVOKTL-UHFFFAOYSA-N
Data: 1 IC50
Activity Spreadsheet -- Enzyme Inhibition Constant Data from BindingDB
Found 1 hit for monomerid = 50140436
Trg + Lig
Ki
nM
ΔG°
kcal/mole
IC50
nM
Kd
nM
EC50/IC50
nM
koff
s-1
kon
M-1s-1
pHTemp
°C
Coagulation factor X
(Homo sapiens (Human))
BDBM50140436
(2-(3-Fluoro-naphthalen-2-yl)-5-methyl-2H-pyrazole-...)
Show SMILES CN(C)C(=N)c1ccc(NC(=O)c2cc(C)nn2-c2cc3ccccc3cc2F)s1
Show InChI InChI=1S/C22H20FN5OS/c1-13-10-18(22(29)25-20-9-8-19(30-20)21(24)27(2)3)28(26-13)17-12-15-7-5-4-6-14(15)11-16(17)23/h4-12,24H,1-3H3,(H,25,29)
Reactome pathway
n/an/a 511n/an/an/an/an/an/a
Millennium Pharmaceuticals Inc.
Curated by ChEMBL
Assay Description
In vitro inhibitory activity against human coagulation factor X
Bioorg Med Chem Lett 14: 1229-34 (2004)
Article DOI: 10.1016/j.bmcl.2003.12.054
BindingDB Entry DOI: 10.7270/Q2QN6664