BDBM50140590 2N-methyl-3-(3-chloro-4-hydroxybenzyl)-5-ethyl-4-oxo-(6aR,9aS)-3,4,5,8-tetrahydrocyclopenta[4,5]imidazo[2,1-b]purine-2-carboxamide::CHEMBL23375
SMILES: CCN1C2=N[C@@H]3CCC[C@@H]3N2c2nc(C(=O)NC)n(Cc3ccc(O)c(Cl)c3)c2C1=O
InChI Key: InChIKey=FTOJUJFKGZQBQW-KGLIPLIRSA-N
Data: 2 IC50
Activity Spreadsheet -- Enzyme Inhibition Constant Data from BindingDB
Found 2 hits for monomerid = 50140590
Trg + Lig
Ki
nM
ΔG°
kcal/mole
IC50
nM
Kd
nM
EC50/IC50
nM
koff
s-1
kon
M-1s-1
pHTemp
°C
cGMP-specific 3',5'-cyclic phosphodiesterase
(Homo sapiens (Human))
BDBM50140590
(2N-methyl-3-(3-chloro-4-hydroxybenzyl)-5-ethyl-4-o...)
Show SMILES CCN1C2=N[C@@H]3CCC[C@@H]3N2c2nc(C(=O)NC)n(Cc3ccc(O)c(Cl)c3)c2C1=O |r,t:3|
Show InChI InChI=1S/C21H23ClN6O3/c1-3-26-20(31)16-17(28-14-6-4-5-13(14)24-21(26)28)25-18(19(30)23-2)27(16)10-11-7-8-15(29)12(22)9-11/h7-9,13-14,29H,3-6,10H2,1-2H3,(H,23,30)/t13-,14+/m1/s1
Reactome pathway
n/an/a 1.30n/an/an/an/an/an/a
Universidade Federal de Lavras-UFLA
Curated by ChEMBL
Assay Description
Inhibition of PDE5
Eur J Med Chem 43: 1632-8 (2008)
Article DOI: 10.1016/j.ejmech.2007.10.019
BindingDB Entry DOI: 10.7270/Q2Q81F9P
cGMP-specific 3',5'-cyclic phosphodiesterase
(Homo sapiens (Human))
BDBM50140590
(2N-methyl-3-(3-chloro-4-hydroxybenzyl)-5-ethyl-4-o...)
Show SMILES CCN1C2=N[C@@H]3CCC[C@@H]3N2c2nc(C(=O)NC)n(Cc3ccc(O)c(Cl)c3)c2C1=O |r,t:3|
Show InChI InChI=1S/C21H23ClN6O3/c1-3-26-20(31)16-17(28-14-6-4-5-13(14)24-21(26)28)25-18(19(30)23-2)27(16)10-11-7-8-15(29)12(22)9-11/h7-9,13-14,29H,3-6,10H2,1-2H3,(H,23,30)/t13-,14+/m1/s1
Reactome pathway
n/an/a 1.30n/an/an/an/an/an/a
Schering-Plough Research Institute
Curated by ChEMBL
Assay Description
Inhibitory concentration against human phosphodiesterase 5 (PDE5) enzyme
Bioorg Med Chem Lett 14: 1291-4 (2004)
Article DOI: 10.1016/j.bmcl.2003.12.027
BindingDB Entry DOI: 10.7270/Q2BG2NF0