BDBM50140893 CHEMBL3753932::US10383880, Example 123
SMILES: OC(CN1CCCNS1(=O)=O)Cn1c2ccccc2c2ccccc12
InChI Key: InChIKey=BBBPEHQCJMODKI-UHFFFAOYSA-N
Data: 2 EC50
Activity Spreadsheet -- Enzyme Inhibition Constant Data from BindingDB
Found 2 hits for monomerid = 50140893
Trg + Lig
Ki
nM
ΔG°
kcal/mole
IC50
nM
Kd
nM
EC50/IC50
nM
koff
s-1
kon
M-1s-1
pHTemp
°C
Period circadian protein homolog 2
(Homo sapiens (Human))
BDBM50140893
(CHEMBL3753932 | US10383880, Example 123)
Show SMILES OC(CN1CCCNS1(=O)=O)Cn1c2ccccc2c2ccccc12
Show InChI InChI=1S/C18H21N3O3S/c22-14(12-20-11-5-10-19-25(20,23)24)13-21-17-8-3-1-6-15(17)16-7-2-4-9-18(16)21/h1-4,6-9,14,19,22H,5,10-13H2
US Patent
n/an/an/an/a 33n/an/an/an/a
Synchronicity
US Patent
Assay Description
Per2 Assay for Evaluating the Potency of Test Compounds.
US Patent US10383880 (2019)
BindingDB Entry DOI: 10.7270/Q2J67K8X
Period circadian protein homolog 2
(Homo sapiens (Human))
BDBM50140893
(CHEMBL3753932 | US10383880, Example 123)
Show SMILES OC(CN1CCCNS1(=O)=O)Cn1c2ccccc2c2ccccc12
Show InChI InChI=1S/C18H21N3O3S/c22-14(12-20-11-5-10-19-25(20,23)24)13-21-17-8-3-1-6-15(17)16-7-2-4-9-18(16)21/h1-4,6-9,14,19,22H,5,10-13H2
n/an/an/an/a 384n/an/an/an/a
Reset Therapeutics
Curated by ChEMBL
Assay Description
Reduction of amplitude effect of PER2 in human U2OS cells harboring Per2-dLuc luciferase reporter gene assessed as effects on circadian rhythms
Bioorg Med Chem Lett 26: 757-60 (2016)
BindingDB Entry DOI: 10.7270/Q2DR2XCS