BDBM50140920 CHEMBL3752323::US10383880, Example 49
SMILES: CC(C)CN(CC(O)Cn1c2ccccc2c2ccccc12)S(C)(=O)=O
InChI Key: InChIKey=ZBRXNRXBDZNDTR-UHFFFAOYSA-N
Data: 2 EC50
Activity Spreadsheet -- Enzyme Inhibition Constant Data from BindingDB
Found 2 hits for monomerid = 50140920
Trg + Lig
Ki
nM
ΔG°
kcal/mole
IC50
nM
Kd
nM
EC50/IC50
nM
koff
s-1
kon
M-1s-1
pHTemp
°C
Period circadian protein homolog 2
(Homo sapiens (Human))
BDBM50140920
(CHEMBL3752323 | US10383880, Example 49)
Show SMILES CC(C)CN(CC(O)Cn1c2ccccc2c2ccccc12)S(C)(=O)=O
Show InChI InChI=1S/C20H26N2O3S/c1-15(2)12-21(26(3,24)25)13-16(23)14-22-19-10-6-4-8-17(19)18-9-5-7-11-20(18)22/h4-11,15-16,23H,12-14H2,1-3H3
US Patent
n/an/an/an/a 100n/an/an/an/a
Synchronicity
US Patent
Assay Description
Per2 Assay for Evaluating the Potency of Test Compounds.
US Patent US10383880 (2019)
BindingDB Entry DOI: 10.7270/Q2J67K8X
Period circadian protein homolog 2
(Homo sapiens (Human))
BDBM50140920
(CHEMBL3752323 | US10383880, Example 49)
Show SMILES CC(C)CN(CC(O)Cn1c2ccccc2c2ccccc12)S(C)(=O)=O
Show InChI InChI=1S/C20H26N2O3S/c1-15(2)12-21(26(3,24)25)13-16(23)14-22-19-10-6-4-8-17(19)18-9-5-7-11-20(18)22/h4-11,15-16,23H,12-14H2,1-3H3
n/an/an/an/a 178n/an/an/an/a
Reset Therapeutics
Curated by ChEMBL
Assay Description
Reduction of amplitude effect of PER2 in human U2OS cells harboring Per2-dLuc luciferase reporter gene assessed as effects on circadian rhythms
Bioorg Med Chem Lett 26: 757-60 (2016)
BindingDB Entry DOI: 10.7270/Q2DR2XCS