null
SMILES: [O-]C(=O)C(=O)CC(=O)c1ccc2C(CCC(N=[N+]=[N-])c2c1)N=[N+]=[N-]
InChI Key: InChIKey=ANELOJBUGMHPPW-UHFFFAOYSA-M
Activity Spreadsheet -- Enzyme Inhibition Constant Data from BindingDB
Found 1 hit for monomerid = 50141226
Trg + Lig
Ki
nM
ΔG°
kcal/mole
IC50
nM
Kd
nM
EC50/IC50
nM
koff
s-1
kon
M-1s-1
pHTemp
°C
Integrase
(Human immunodeficiency virus 1)
BDBM50141226
((Z)-4-(5,8-Diazido-5,6,7,8-tetrahydro-naphthalen-2...)
Show SMILES [O-]C(=O)C(=O)CC(=O)c1ccc2C(CCC(N=[N+]=[N-])c2c1)N=[N+]=[N-]
Show InChI InChI=1S/C14H12N6O4/c15-19-17-10-3-4-11(18-20-16)9-5-7(1-2-8(9)10)12(21)6-13(22)14(23)24/h1-2,5,10-11H,3-4,6H2,(H,23,24)/p-1
n/an/a 320n/an/an/an/an/an/a
University of Houston
Curated by ChEMBL
Assay Description
Inhibitory activity against HIV-1 integrase
Bioorg Med Chem Lett 14: 1447-54 (2004)
Article DOI: 10.1016/j.bmcl.2004.01.027
BindingDB Entry DOI: 10.7270/Q2B858PN