BDBM50141254 CHEMBL422579::N-[4-Chloro-3-(5-chloro-benzooxazol-2-yl)-phenyl]-2-cyano-acetamide
SMILES: Clc1ccc2oc(nc2c1)-c1cc(NC(=O)CC#N)ccc1Cl
InChI Key: InChIKey=NPYUCZYMUQVUOU-UHFFFAOYSA-N
Data: 1 IC50
Activity Spreadsheet -- Enzyme Inhibition Constant Data from BindingDB
Found 1 hit for monomerid = 50141254
Trg + Lig
Ki
nM
ΔG°
kcal/mole
IC50
nM
Kd
nM
EC50/IC50
nM
koff
s-1
kon
M-1s-1
pHTemp
°C
1-acylglycerol-3-phosphate O-acyltransferase beta
(Homo sapiens (Human))
BDBM50141254
(CHEMBL422579 | N-[4-Chloro-3-(5-chloro-benzooxazol...)
Show SMILES Clc1ccc2oc(nc2c1)-c1cc(NC(=O)CC#N)ccc1Cl
Show InChI InChI=1S/C16H9Cl2N3O2/c17-9-1-4-14-13(7-9)21-16(23-14)11-8-10(2-3-12(11)18)20-15(22)5-6-19/h1-4,7-8H,5H2,(H,20,22)
Reactome pathway
n/an/a 27n/an/an/an/an/an/a
Cell Therapeutics, Inc.
Curated by ChEMBL
Assay Description
Inhibitory concentration against human lysophosphatidic acid acyltransferase-beta (LPAAT-beta) expressed in Sf9 insect cell membranes
Bioorg Med Chem Lett 14: 1455-9 (2004)
Article DOI: 10.1016/j.bmcl.2004.01.023
BindingDB Entry DOI: 10.7270/Q20Z72Q5