BDBM50141291 CHEMBL32553::[4-Chloro-3-(5-chloro-benzooxazol-2-yl)-phenyl]-carbamic acid but-3-ynyl ester
SMILES: Clc1ccc2oc(nc2c1)-c1cc(NC(=O)OCCC#C)ccc1Cl
InChI Key: InChIKey=CSBPOQBARSENTI-UHFFFAOYSA-N
Data: 1 IC50
Activity Spreadsheet -- Enzyme Inhibition Constant Data from BindingDB
Found 1 hit for monomerid = 50141291
Trg + Lig
Ki
nM
ΔG°
kcal/mole
IC50
nM
Kd
nM
EC50/IC50
nM
koff
s-1
kon
M-1s-1
pHTemp
°C
1-acylglycerol-3-phosphate O-acyltransferase beta
(Homo sapiens (Human))
BDBM50141291
(CHEMBL32553 | [4-Chloro-3-(5-chloro-benzooxazol-2-...)
Show SMILES Clc1ccc2oc(nc2c1)-c1cc(NC(=O)OCCC#C)ccc1Cl
Show InChI InChI=1S/C18H12Cl2N2O3/c1-2-3-8-24-18(23)21-12-5-6-14(20)13(10-12)17-22-15-9-11(19)4-7-16(15)25-17/h1,4-7,9-10H,3,8H2,(H,21,23)
Reactome pathway
n/an/a 75n/an/an/an/an/an/a
Cell Therapeutics, Inc.
Curated by ChEMBL
Assay Description
Inhibitory concentration against human lysophosphatidic acid acyltransferase-beta (LPAAT-beta) expressed in Sf9 insect cell membranes
Bioorg Med Chem Lett 14: 1455-9 (2004)
Article DOI: 10.1016/j.bmcl.2004.01.023
BindingDB Entry DOI: 10.7270/Q20Z72Q5