null
SMILES: Nc1ccccc1SC(=N)C(C#N)c1cccc(c1)C(O)c1ccncc1
InChI Key: InChIKey=SARFSLLDUHVAON-UHFFFAOYSA-N
Activity Spreadsheet -- Enzyme Inhibition Constant Data from BindingDB
Found 2 hits for monomerid = 50141410
Trg + Lig
Ki
nM
ΔG°
kcal/mole
IC50
nM
Kd
nM
EC50/IC50
nM
koff
s-1
kon
M-1s-1
pHTemp
°C
Dual specificity mitogen-activated protein kinase kinase 3
(Homo sapiens (Human))
BDBM50141410
((Z)-3-Amino-3-(2-amino-phenylsulfanyl)-2-[3-(hydro...)
Show SMILES Nc1ccccc1SC(=N)C(C#N)c1cccc(c1)C(O)c1ccncc1
Show InChI InChI=1S/C21H18N4OS/c22-13-17(21(24)27-19-7-2-1-6-18(19)23)15-4-3-5-16(12-15)20(26)14-8-10-25-11-9-14/h1-12,17,20,24,26H,23H2
Reactome pathway
n/an/a>1.00E+3n/an/an/an/an/an/a
Bristol-Myers Squibb Pharmaceuticals Research Institute
Curated by ChEMBL
Assay Description
Inhibitory potency against MAP kinase kinase 3 (MKK3)
Bioorg Med Chem Lett 14: 1483-6 (2004)
Article DOI: 10.1016/j.bmcl.2004.01.012
BindingDB Entry DOI: 10.7270/Q2H131F0
Dual specificity mitogen-activated protein kinase kinase 1
(Homo sapiens (Human))
BDBM50141410
((Z)-3-Amino-3-(2-amino-phenylsulfanyl)-2-[3-(hydro...)
Show SMILES Nc1ccccc1SC(=N)C(C#N)c1cccc(c1)C(O)c1ccncc1
Show InChI InChI=1S/C21H18N4OS/c22-13-17(21(24)27-19-7-2-1-6-18(19)23)15-4-3-5-16(12-15)20(26)14-8-10-25-11-9-14/h1-12,17,20,24,26H,23H2
Reactome pathway
n/an/a 12n/an/an/an/an/an/a
Bristol-Myers Squibb Pharmaceuticals Research Institute
Curated by ChEMBL
Assay Description
Inhibitory potency against mitogen activated protein kinase kinase kinase 1
Bioorg Med Chem Lett 14: 1483-6 (2004)
Article DOI: 10.1016/j.bmcl.2004.01.012
BindingDB Entry DOI: 10.7270/Q2H131F0