BDBM50141460 (5S,6R,7R)-5-Benzo[1,3]dioxol-5-yl-7-[2-(3-hydroxy-2-methyl-propyl)-4-methoxy-phenyl]-2-isopropylamino-6,7-dihydro-5H-[1]pyrindine-6-carboxylic acid::CHEMBL288247
SMILES: COc1ccc([C@H]2[C@@H]([C@H](c3ccc(NC(C)C)nc23)c2ccc3OCOc3c2)C(O)=O)c(CC(C)CO)c1
InChI Key: InChIKey=KBHRSNOQJNLUNL-DULCMVPVSA-N
Data: 4 IC50
Activity Spreadsheet -- Enzyme Inhibition Constant Data from BindingDB
Found 4 hits for monomerid = 50141460
Trg + Lig
Ki
nM
ΔG°
kcal/mole
IC50
nM
Kd
nM
EC50/IC50
nM
koff
s-1
kon
M-1s-1
pHTemp
°C
Endothelin-1 receptor
(Homo sapiens (Human))
BDBM50141460
((5S,6R,7R)-5-Benzo[1,3]dioxol-5-yl-7-[2-(3-hydroxy...)
Show SMILES COc1ccc([C@H]2[C@@H]([C@H](c3ccc(NC(C)C)nc23)c2ccc3OCOc3c2)C(O)=O)c(CC(C)CO)c1
Show InChI InChI=1S/C30H34N2O6/c1-16(2)31-25-10-8-22-26(18-5-9-23-24(13-18)38-15-37-23)28(30(34)35)27(29(22)32-25)21-7-6-20(36-4)12-19(21)11-17(3)14-33/h5-10,12-13,16-17,26-28,33H,11,14-15H2,1-4H3,(H,31,32)(H,34,35)/t17?,26-,27-,28+/m0/s1
n/an/a 0.0590n/an/an/an/an/an/a
Banyu Tsukuba Research Institute in collaboration with Merck Research Laboratories
Curated by ChEMBL
Assay Description
Inhibitory activity against [125I]-ET-1 binding to human endothelin A receptor
Bioorg Med Chem Lett 14: 1503-7 (2004)
Article DOI: 10.1016/j.bmcl.2004.01.008
BindingDB Entry DOI: 10.7270/Q23R0SB4
Endothelin receptor, ET-A/ET-B
(Homo sapiens (Human))
BDBM50141460
((5S,6R,7R)-5-Benzo[1,3]dioxol-5-yl-7-[2-(3-hydroxy...)
Show SMILES COc1ccc([C@H]2[C@@H]([C@H](c3ccc(NC(C)C)nc23)c2ccc3OCOc3c2)C(O)=O)c(CC(C)CO)c1
Show InChI InChI=1S/C30H34N2O6/c1-16(2)31-25-10-8-22-26(18-5-9-23-24(13-18)38-15-37-23)28(30(34)35)27(29(22)32-25)21-7-6-20(36-4)12-19(21)11-17(3)14-33/h5-10,12-13,16-17,26-28,33H,11,14-15H2,1-4H3,(H,31,32)(H,34,35)/t17?,26-,27-,28+/m0/s1
n/an/a 54n/an/an/an/an/an/a
Banyu Tsukuba Research Institute in collaboration with Merck Research Laboratories
Curated by ChEMBL
Assay Description
Inhibitory activity against [125I]-ET-1 binding to human endothelin A receptor
Bioorg Med Chem Lett 14: 1503-7 (2004)
Article DOI: 10.1016/j.bmcl.2004.01.008
BindingDB Entry DOI: 10.7270/Q23R0SB4
Endothelin-1 receptor
(Homo sapiens (Human))
BDBM50141460
((5S,6R,7R)-5-Benzo[1,3]dioxol-5-yl-7-[2-(3-hydroxy...)
Show SMILES COc1ccc([C@H]2[C@@H]([C@H](c3ccc(NC(C)C)nc23)c2ccc3OCOc3c2)C(O)=O)c(CC(C)CO)c1
Show InChI InChI=1S/C30H34N2O6/c1-16(2)31-25-10-8-22-26(18-5-9-23-24(13-18)38-15-37-23)28(30(34)35)27(29(22)32-25)21-7-6-20(36-4)12-19(21)11-17(3)14-33/h5-10,12-13,16-17,26-28,33H,11,14-15H2,1-4H3,(H,31,32)(H,34,35)/t17?,26-,27-,28+/m0/s1
n/an/a 0.0410n/an/an/an/an/an/a
Banyu Tsukuba Research Institute in collaboration with Merck Research Laboratories
Curated by ChEMBL
Assay Description
Inhibitory activity against [125I]-ET-1 binding to human endothelin B receptor
Bioorg Med Chem Lett 14: 1503-7 (2004)
Article DOI: 10.1016/j.bmcl.2004.01.008
BindingDB Entry DOI: 10.7270/Q23R0SB4
EDNRB
(Homo sapiens (Human))
BDBM50141460
((5S,6R,7R)-5-Benzo[1,3]dioxol-5-yl-7-[2-(3-hydroxy...)
Show SMILES COc1ccc([C@H]2[C@@H]([C@H](c3ccc(NC(C)C)nc23)c2ccc3OCOc3c2)C(O)=O)c(CC(C)CO)c1
Show InChI InChI=1S/C30H34N2O6/c1-16(2)31-25-10-8-22-26(18-5-9-23-24(13-18)38-15-37-23)28(30(34)35)27(29(22)32-25)21-7-6-20(36-4)12-19(21)11-17(3)14-33/h5-10,12-13,16-17,26-28,33H,11,14-15H2,1-4H3,(H,31,32)(H,34,35)/t17?,26-,27-,28+/m0/s1
n/an/a 51n/an/an/an/an/an/a
Banyu Tsukuba Research Institute in collaboration with Merck Research Laboratories
Curated by ChEMBL
Assay Description
Inhibitory activity against [125I]-ET-1 binding to human endothelin B receptor
Bioorg Med Chem Lett 14: 1503-7 (2004)
Article DOI: 10.1016/j.bmcl.2004.01.008
BindingDB Entry DOI: 10.7270/Q23R0SB4