BDBM50141477 CHEMBL39656::{2,6-Dimethoxy-4-[(E)-3-(2-methoxy-5-thiophen-2-yl-phenyl)-acryloyl]-phenoxy}-acetic acid
SMILES: COc1ccc(cc1\C=C\C(=O)c1cc(OC)c(OCC(O)=O)c(OC)c1)-c1cccs1
InChI Key: InChIKey=JNJIZJBHTNTRPN-SOFGYWHQSA-N
Data: 1 IC50
Activity Spreadsheet -- Enzyme Inhibition Constant Data from BindingDB
Found 1 hit for monomerid = 50141477
Trg + Lig
Ki
nM
ΔG°
kcal/mole
IC50
nM
Kd
nM
EC50/IC50
nM
koff
s-1
kon
M-1s-1
pHTemp
°C
Tumor necrosis factor receptor R1
(Homo sapiens (Human))
BDBM50141477
(CHEMBL39656 | {2,6-Dimethoxy-4-[(E)-3-(2-methoxy-5...)
Show SMILES COc1ccc(cc1\C=C\C(=O)c1cc(OC)c(OCC(O)=O)c(OC)c1)-c1cccs1
Show InChI InChI=1S/C24H22O7S/c1-28-19-9-7-16(22-5-4-10-32-22)11-15(19)6-8-18(25)17-12-20(29-2)24(21(13-17)30-3)31-14-23(26)27/h4-13H,14H2,1-3H3,(H,26,27)/b8-6+
NCI pathway
Reactome pathway
n/an/a 1.00E+3n/an/an/an/an/an/a
AtheroGenics, Inc.
Curated by ChEMBL
Assay Description
Inhibition of TNF-alpha-induced VCAM-1 expression
Bioorg Med Chem Lett 14: 1513-7 (2004)
Article DOI: 10.1016/j.bmcl.2004.01.021
BindingDB Entry DOI: 10.7270/Q2028QZK